{"text_format":"1","workbook":"xlsx","n_sheets":3,"sheets":["RAIN-TANK 2017","Rainfall Data","Rainfall Data (2)"],"not_rendered":{"charts":0,"images":4,"macros":1,"external_links":0,"defined_names":19,"comments":0,"pivot_tables":0},"unopened":[],"bounds":{"document_bytes":16777216,"sheet_cells":100000,"rows_first":2000,"rows_last":500,"rows_between":2000,"halvings":0,"cell_chars":16384,"cell_head_chars":4096},"cells_cut":0,"cells_raw":0,"read":"whole","date_system":"1900"}

{"sheet":"RAIN-TANK 2017","index":0,"n_rows":281,"n_cols":26,"rows_kept":281,"cut":false,"hidden":false,"merged":[[4,2,4,14],[3,9,3,10],[1,7,1,8],[2,7,2,8],[21,2,21,14]]}
[]
[null,"RAINWATER HARVESTING STORAGE WORKSHEET ",null,null,null,null,null,"WEATHER STATION:",null,null,"Saltspring Island",null,null,null,null,null,null,null,"Country"]
[null,"Optimize your storage volume",null,null,null,null,null,"PROJECT NAME:",null,"Test",null,null,null,null,null,null,null,null,"Abbotsford",{"$f":"--ISNUMBER(IFERROR(SEARCH($K$2,S3,1),\"\"))","v":0},{"$f":"IF(T3=1,COUNTIF($T$3:T3,1),\"\")","v":""},{"$f":"IFERROR(INDEX($S$3:$S$281,MATCH(ROWS($U$3:U3),$U$3:$U$281,0)),\"\")","v":"Saltspring Island"},{"$f":"IFERROR(INDEX($S$3:$S$281,MATCH(ROWS($U$3:V3),$U$3:$U$281,0)),\"\")","v":"Saltspring Island"},{"$f":"IFERROR(INDEX($S$3:$S$281,MATCH(ROWS($U$3:U3),$U$3:$U$281,0)),\"\")","v":"Saltspring Island"},null,{"$f":"$V$3:INDEX($V$3:$V$281,MAX($U$3:$U$281),1)","v":"Saltspring Island"}]
[null,null,null,null,null,null,null,"DATE:",null,"2017-07-20",null,null,null,null,null,null,null,null,"Alberton",{"$f":"--ISNUMBER(IFERROR(SEARCH($K$2,S4,1),\"\"))","v":0},{"$f":"IF(T4=1,COUNTIF($T$3:T4,1),\"\")","v":""},{"$f":"IFERROR(INDEX($S$3:$S$281,MATCH(ROWS($U$3:U4),$U$3:$U$281,0)),\"\")","v":""},{"$f":"IFERROR(INDEX($S$3:$S$281,MATCH(ROWS($U$3:V4),$U$3:$U$281,0)),\"\")","v":""},{"$f":"IFERROR(INDEX($S$3:$S$281,MATCH(ROWS($U$3:U4),$U$3:$U$281,0)),\"\")","v":""},null,{"$f":"$V$3:INDEX($V$3:$V$281,MAX($U$3:$U$281),1)","v":"Saltspring Island"}]
[null,null,"INPUTS",null,null,null,null,null,null,null,null,null,null,null,null,null,null,null,"Alliston",0,{"$f":"IF(T5=1,COUNTIF($T$3:T5,1),\"\")","v":""},{"$f":"IFERROR(INDEX($S$3:$S$281,MATCH(ROWS($U$3:U5),$U$3:$U$281,0)),\"\")","v":""},{"$f":"IFERROR(INDEX($S$3:$S$281,MATCH(ROWS($U$3:V5),$U$3:$U$281,0)),\"\")","v":""},{"$f":"IFERROR(INDEX($S$3:$S$281,MATCH(ROWS($U$3:U5),$U$3:$U$281,0)),\"\")","v":""},null,{"$f":"$V$3:INDEX($V$3:$V$281,MAX($U$3:$U$281),1)","v":"Saltspring Island"}]
[null,null,null,null,null,null,null,null,null,null,null,null,null,null,null,null,null,null,"Amherst - Nappan",0,{"$f":"IF(T6=1,COUNTIF($T$3:T6,1),\"\")","v":""},{"$f":"IFERROR(INDEX($S$3:$S$281,MATCH(ROWS($U$3:U6),$U$3:$U$281,0)),\"\")","v":""},{"$f":"IFERROR(INDEX($S$3:$S$281,MATCH(ROWS($U$3:V6),$U$3:$U$281,0)),\"\")","v":""},{"$f":"IFERROR(INDEX($S$3:$S$281,MATCH(ROWS($U$3:U6),$U$3:$U$281,0)),\"\")","v":""},null,{"$f":"$V$3:INDEX($V$3:$V$281,MAX($U$3:$U$281),1)","v":"Saltspring Island"}]
[null,"MONTH","JAN","FEB","MAR","APR","MAY","JUN","JUL","AUG","SEPT","OCT","NOV","DEC","TOTAL","Column1",null,null,"Amos",0,{"$f":"IF(T7=1,COUNTIF($T$3:T7,1),\"\")","v":""},{"$f":"IFERROR(INDEX($S$3:$S$281,MATCH(ROWS($U$3:U7),$U$3:$U$281,0)),\"\")","v":""},{"$f":"IFERROR(INDEX($S$3:$S$281,MATCH(ROWS($U$3:V7),$U$3:$U$281,0)),\"\")","v":""},{"$f":"IFERROR(INDEX($S$3:$S$281,MATCH(ROWS($U$3:U7),$U$3:$U$281,0)),\"\")","v":""},null,{"$f":"$V$3:INDEX($V$3:$V$281,MAX($U$3:$U$281),1)","v":"Saltspring Island"}]
[null,"Environment Canada Precipitation (mm)                             ",{"$f":"VLOOKUP($K$2,'Rainfall Data'!$A$4:$O$271,2,FALSE)","v":162},{"$f":"VLOOKUP($K$2,'Rainfall Data'!$A$4:$O$271,3,FALSE)","v":99},{"$f":"VLOOKUP($K$2,'Rainfall Data'!$A$4:$O$271,4,FALSE)","v":89},{"$f":"VLOOKUP($K$2,'Rainfall Data'!$A$4:$O$271,5,FALSE)","v":57},{"$f":"VLOOKUP($K$2,'Rainfall Data'!$A$4:$O$271,6,FALSE)","v":43},{"$f":"VLOOKUP($K$2,'Rainfall Data'!$A$4:$O$271,7,FALSE)","v":37},{"$f":"VLOOKUP($K$2,'Rainfall Data'!$A$4:$O$271,8,FALSE)","v":23},{"$f":"VLOOKUP($K$2,'Rainfall Data'!$A$4:$O$271,9,FALSE)","v":28},{"$f":"VLOOKUP($K$2,'Rainfall Data'!$A$4:$O$271,10,FALSE)","v":33},{"$f":"VLOOKUP($K$2,'Rainfall Data'!$A$4:$O$271,11,FALSE)","v":94},{"$f":"VLOOKUP($K$2,'Rainfall Data'!$A$4:$O$271,12,FALSE)","v":168},{"$f":"VLOOKUP($K$2,'Rainfall Data'!$A$4:$O$271,13,FALSE)","v":154},{"$f":"SUM(CheckList1[[#This Row],[JAN]:[DEC]])","v":987},null,null,null,"Annapolis Royal",0,{"$f":"IF(T8=1,COUNTIF($T$3:T8,1),\"\")","v":""},{"$f":"IFERROR(INDEX($S$3:$S$281,MATCH(ROWS($U$3:U8),$U$3:$U$281,0)),\"\")","v":""},{"$f":"IFERROR(INDEX($S$3:$S$281,MATCH(ROWS($U$3:V8),$U$3:$U$281,0)),\"\")","v":""},{"$f":"IFERROR(INDEX($S$3:$S$281,MATCH(ROWS($U$3:U8),$U$3:$U$281,0)),\"\")","v":""},null,{"$f":"$V$3:INDEX($V$3:$V$281,MAX($U$3:$U$281),1)","v":"Saltspring Island"}]
[null,"mm to Inches & inches  to Gallon",{"$f":"(C8/25.4)*(6.24/12)","v":3.3165354330708663},2.0267716535433071,1.8220472440944881,1.1669291338582677,0.88031496062992132,0.75748031496062995,0.47086614173228353,0.57322834645669296,0.67559055118110245,1.9244094488188976,3.4393700787401578,3.1527559055118117,{"$f":"SUM(CheckList1[[#This Row],[JAN]:[DEC]])","v":20.206299212598424},null,null,null,"Atikokan",0,{"$f":"IF(T9=1,COUNTIF($T$3:T9,1),\"\")","v":""},{"$f":"IFERROR(INDEX($S$3:$S$281,MATCH(ROWS($U$3:U9),$U$3:$U$281,0)),\"\")","v":""},{"$f":"IFERROR(INDEX($S$3:$S$281,MATCH(ROWS($U$3:V9),$U$3:$U$281,0)),\"\")","v":""},{"$f":"IFERROR(INDEX($S$3:$S$281,MATCH(ROWS($U$3:U9),$U$3:$U$281,0)),\"\")","v":""},null,{"$f":"$V$3:INDEX($V$3:$V$281,MAX($U$3:$U$281),1)","v":"Saltspring Island"}]
[null,"Precipitation Received from Roof (imp gals)",{"$f":"($C$37*C9)*$C$38","v":6633.0708661417339},4053.5433070866147,3644.0944881889768,2333.8582677165355,1760.6299212598428,1514.9606299212601,941.7322834645671,1146.456692913386,1351.1811023622049,3848.8188976377955,6878.7401574803152,6305.5118110236235,{"$f":"SUM(CheckList1[[#This Row],[JAN]:[DEC]])","v":40412.598425196862},null,null,null,"Atlin",0,{"$f":"IF(T10=1,COUNTIF($T$3:T10,1),\"\")","v":""},{"$f":"IFERROR(INDEX($S$3:$S$281,MATCH(ROWS($U$3:U10),$U$3:$U$281,0)),\"\")","v":""},{"$f":"IFERROR(INDEX($S$3:$S$281,MATCH(ROWS($U$3:V10),$U$3:$U$281,0)),\"\")","v":""},{"$f":"IFERROR(INDEX($S$3:$S$281,MATCH(ROWS($U$3:U10),$U$3:$U$281,0)),\"\")","v":""},null,{"$f":"$V$3:INDEX($V$3:$V$281,MAX($U$3:$U$281),1)","v":"Saltspring Island"}]
[null,"Start of Month in Storage (imp gals) (Last Dec.)        ",null,{"$f":"IF(C17>0,(C17),(0))","v":4133.0708661417339},{"$f":"IF(D17>0,(D17),(0))","v":5686.6141732283486},6830.7086614173259,6664.5669291338618,5925.1968503937042,4940.1574803149642,1381.8897637795317,0,0,1348.8188976377955,5727.5590551181103,null,null,null,null,"Baddeck",0,{"$f":"IF(T11=1,COUNTIF($T$3:T11,1),\"\")","v":""},{"$f":"IFERROR(INDEX($S$3:$S$281,MATCH(ROWS($U$3:U11),$U$3:$U$281,0)),\"\")","v":""},{"$f":"IFERROR(INDEX($S$3:$S$281,MATCH(ROWS($U$3:V11),$U$3:$U$281,0)),\"\")","v":""},{"$f":"IFERROR(INDEX($S$3:$S$281,MATCH(ROWS($U$3:U11),$U$3:$U$281,0)),\"\")","v":""},null,{"$f":"$V$3:INDEX($V$3:$V$281,MAX($U$3:$U$281),1)","v":"Saltspring Island"}]
[null,"Household Usage (imp gals)                        ",2500,2500,2500,2500,2500,2500,2500,2500,2500,2500,2500,2500,{"$f":"SUM(CheckList1[[#This Row],[JAN]:[DEC]])","v":30000},null,null,null,"Baie Verte",0,{"$f":"IF(T12=1,COUNTIF($T$3:T12,1),\"\")","v":""},{"$f":"IFERROR(INDEX($S$3:$S$281,MATCH(ROWS($U$3:U12),$U$3:$U$281,0)),\"\")","v":""},{"$f":"IFERROR(INDEX($S$3:$S$281,MATCH(ROWS($U$3:V12),$U$3:$U$281,0)),\"\")","v":""},{"$f":"IFERROR(INDEX($S$3:$S$281,MATCH(ROWS($U$3:U12),$U$3:$U$281,0)),\"\")","v":""},null,{"$f":"$V$3:INDEX($V$3:$V$281,MAX($U$3:$U$281),1)","v":"Saltspring Island"}]
[null,"Irrigation/Outside Usage (imp gals) (make-up)                           ",null,null,null,null,null,null,2000,2000,2000,null,null,null,{"$f":"SUM(CheckList1[[#This Row],[JAN]:[DEC]])","v":6000},null,null,null,"Baie-Comeau",0,{"$f":"IF(T13=1,COUNTIF($T$3:T13,1),\"\")","v":""},{"$f":"IFERROR(INDEX($S$3:$S$281,MATCH(ROWS($U$3:U13),$U$3:$U$281,0)),\"\")","v":""},{"$f":"IFERROR(INDEX($S$3:$S$281,MATCH(ROWS($U$3:V13),$U$3:$U$281,0)),\"\")","v":""},{"$f":"IFERROR(INDEX($S$3:$S$281,MATCH(ROWS($U$3:U13),$U$3:$U$281,0)),\"\")","v":""},null,{"$f":"$V$3:INDEX($V$3:$V$281,MAX($U$3:$U$281),1)","v":"Saltspring Island"}]
[null,"Total Usage  (imp gals)",{"$f":"C13+C12","v":2500},{"$f":"D13+D12","v":2500},2500,2500,2500,2500,4500,4500,4500,2500,2500,2500,{"$f":"SUM(CheckList1[[#This Row],[JAN]:[DEC]])","v":36000},null,null,null,"Baltic",0,{"$f":"IF(T14=1,COUNTIF($T$3:T14,1),\"\")","v":""},{"$f":"IFERROR(INDEX($S$3:$S$281,MATCH(ROWS($U$3:U14),$U$3:$U$281,0)),\"\")","v":""},{"$f":"IFERROR(INDEX($S$3:$S$281,MATCH(ROWS($U$3:V14),$U$3:$U$281,0)),\"\")","v":""},{"$f":"IFERROR(INDEX($S$3:$S$281,MATCH(ROWS($U$3:U14),$U$3:$U$281,0)),\"\")","v":""},null,{"$f":"$V$3:INDEX($V$3:$V$281,MAX($U$3:$U$281),1)","v":"Saltspring Island"}]
[null,"End of Month (no Storage Limit) (imp gals)",{"$f":"C10+C11-C14","v":4133.0708661417339},5686.6141732283486,6830.7086614173259,6664.5669291338618,5925.1968503937042,4940.1574803149642,1381.8897637795317,-1971.6535433070821,-3148.8188976377951,1348.8188976377955,5727.5590551181103,9533.0708661417339,null,{"$f":"SUM(CheckList1[[#This Row],[JAN]:[DEC]])","v":47051.181102362229},null,null,"Banff",0,{"$f":"IF(T15=1,COUNTIF($T$3:T15,1),\"\")","v":""},{"$f":"IFERROR(INDEX($S$3:$S$281,MATCH(ROWS($U$3:U15),$U$3:$U$281,0)),\"\")","v":""},{"$f":"IFERROR(INDEX($S$3:$S$281,MATCH(ROWS($U$3:V15),$U$3:$U$281,0)),\"\")","v":""},{"$f":"IFERROR(INDEX($S$3:$S$281,MATCH(ROWS($U$3:U15),$U$3:$U$281,0)),\"\")","v":""},null,{"$f":"$V$3:INDEX($V$3:$V$281,MAX($U$3:$U$281),1)","v":"Saltspring Island"}]
[null,"Overflow Volume - wastage  (imp gals)",{"$f":"C15-C17","v":0},{"$f":"D15-D17","v":0},0,0,0,0,0,0,0,0,0,0,{"$f":"SUM(CheckList1[[#This Row],[JAN]:[DEC]])","v":0}]
[null,"End of Month in Storage (imp gals) (make-up)",{"$f":"IF(C15>$C$36,($C$36),(C15))","v":4133.0708661417339},5686.6141732283486,6830.7086614173259,6664.5669291338618,5925.1968503937042,4940.1574803149642,1381.8897637795317,-1971.6535433070821,-3148.8188976377951,1348.8188976377955,5727.5590551181103,9533.0708661417339,null,{"$f":"SUM(CheckList1[[#This Row],[JAN]:[DEC]])","v":47051.181102362229},null,null,"Bangor",0,{"$f":"IF(T17=1,COUNTIF($T$3:T17,1),\"\")","v":""},{"$f":"IFERROR(INDEX($S$3:$S$281,MATCH(ROWS($U$3:U17),$U$3:$U$281,0)),\"\")","v":""},{"$f":"IFERROR(INDEX($S$3:$S$281,MATCH(ROWS($U$3:V17),$U$3:$U$281,0)),\"\")","v":""},{"$f":"IFERROR(INDEX($S$3:$S$281,MATCH(ROWS($U$3:U17),$U$3:$U$281,0)),\"\")","v":""},null,{"$f":"$V$3:INDEX($V$3:$V$281,MAX($U$3:$U$281),1)","v":"Saltspring Island"}]
[null,"ANNUAL OVERFLOW VOLUME (WASTAGE)",{"$f":"100%-((O10-(P15-P17))/O10)","v":0},null,null,null,null,null,null,null,null,null,null,null,null,null,null,null,"Barkerville",0,{"$f":"IF(T18=1,COUNTIF($T$3:T18,1),\"\")","v":""},{"$f":"IFERROR(INDEX($S$3:$S$281,MATCH(ROWS($U$3:U18),$U$3:$U$281,0)),\"\")","v":""},{"$f":"IFERROR(INDEX($S$3:$S$281,MATCH(ROWS($U$3:V18),$U$3:$U$281,0)),\"\")","v":""},{"$f":"IFERROR(INDEX($S$3:$S$281,MATCH(ROWS($U$3:U18),$U$3:$U$281,0)),\"\")","v":""},null,{"$f":"$V$3:INDEX($V$3:$V$281,MAX($U$3:$U$281),1)","v":"Saltspring Island"}]
[null,"ANNUAL MAKE-UP WATER (SHORTFALL) ",{"$f":"(IF(C15<0,($C15),(0))+IF(D15<0,($D15),(0))+IF(E15<0,($E15),(0))+IF(F15<0,($F15),(0))+IF(G15<0,($G15),(0))+IF(H15<0,($H15),(0))+IF(I15<0,($I15),(0))+IF(J15<0,($J15),(0))+IF(K15<0,($K15),(0))+IF(L15<0,($L15),(0))+IF(M15<0,($M15),(0))+IF(N15<0,($N15),(0)))/O14","v":-0.14223534558180215},null,null,null,null,null,null,null,null,null,null,null,null,null,null,null,"Barrie",0,{"$f":"IF(T19=1,COUNTIF($T$3:T19,1),\"\")","v":""},{"$f":"IFERROR(INDEX($S$3:$S$281,MATCH(ROWS($U$3:U19),$U$3:$U$281,0)),\"\")","v":""},{"$f":"IFERROR(INDEX($S$3:$S$281,MATCH(ROWS($U$3:V19),$U$3:$U$281,0)),\"\")","v":""},{"$f":"IFERROR(INDEX($S$3:$S$281,MATCH(ROWS($U$3:U19),$U$3:$U$281,0)),\"\")","v":""},null,{"$f":"$V$3:INDEX($V$3:$V$281,MAX($U$3:$U$281),1)","v":"Saltspring Island"}]
[null,null,null,null,null,null,null,null,null,null,null,null,null,null,null,null,null,null,"Bathurst",0,{"$f":"IF(T20=1,COUNTIF($T$3:T20,1),\"\")","v":""},{"$f":"IFERROR(INDEX($S$3:$S$281,MATCH(ROWS($U$3:U20),$U$3:$U$281,0)),\"\")","v":""},{"$f":"IFERROR(INDEX($S$3:$S$281,MATCH(ROWS($U$3:V20),$U$3:$U$281,0)),\"\")","v":""},{"$f":"IFERROR(INDEX($S$3:$S$281,MATCH(ROWS($U$3:U20),$U$3:$U$281,0)),\"\")","v":""},null,{"$f":"$V$3:INDEX($V$3:$V$281,MAX($U$3:$U$281),1)","v":"Saltspring Island"}]
[null,null,null,null,null,null,null,null,null,null,null,null,null,null,null,null,null,null,"Blanc-Sablon",0,{"$f":"IF(T21=1,COUNTIF($T$3:T21,1),\"\")","v":""},{"$f":"IFERROR(INDEX($S$3:$S$281,MATCH(ROWS($U$3:U21),$U$3:$U$281,0)),\"\")","v":""},{"$f":"IFERROR(INDEX($S$3:$S$281,MATCH(ROWS($U$3:V21),$U$3:$U$281,0)),\"\")","v":""},{"$f":"IFERROR(INDEX($S$3:$S$281,MATCH(ROWS($U$3:U21),$U$3:$U$281,0)),\"\")","v":""},null,{"$f":"$V$3:INDEX($V$3:$V$281,MAX($U$3:$U$281),1)","v":"Saltspring Island"}]
[null,null,"OUTPUTS",null,null,null,null,null,null,null,null,null,null,null,null,null,null,null,"Alliston",{"$f":"--ISNUMBER(IFERROR(SEARCH($K$2,S22,1),\"\"))","v":0},{"$f":"IF(T22=1,COUNTIF($T$3:T22,1),\"\")","v":""},{"$f":"IFERROR(INDEX($S$3:$S$281,MATCH(ROWS($U$3:U22),$U$3:$U$281,0)),\"\")","v":""},{"$f":"IFERROR(INDEX($S$3:$S$281,MATCH(ROWS($U$3:V22),$U$3:$U$281,0)),\"\")","v":""},{"$f":"IFERROR(INDEX($S$3:$S$281,MATCH(ROWS($U$3:U22),$U$3:$U$281,0)),\"\")","v":""},null,{"$f":"$V$3:INDEX($V$3:$V$281,MAX($U$3:$U$281),1)","v":"Saltspring Island"}]
[null,null,null,null,null,null,null,null,null,null,null,null,null,null,null,null,null,null,"Amherst - Nappan",0,{"$f":"IF(T23=1,COUNTIF($T$3:T23,1),\"\")","v":""},{"$f":"IFERROR(INDEX($S$3:$S$281,MATCH(ROWS($U$3:U23),$U$3:$U$281,0)),\"\")","v":""},{"$f":"IFERROR(INDEX($S$3:$S$281,MATCH(ROWS($U$3:V23),$U$3:$U$281,0)),\"\")","v":""},{"$f":"IFERROR(INDEX($S$3:$S$281,MATCH(ROWS($U$3:U23),$U$3:$U$281,0)),\"\")","v":""},null,{"$f":"$V$3:INDEX($V$3:$V$281,MAX($U$3:$U$281),1)","v":"Saltspring Island"}]
[null,"MONTH","JAN","FEB","MAR","APR","MAY","JUN","JUL","AUG","SEPT","OCT","NOV","DEC","TOTAL","Column1",null,null,"Amos",0,{"$f":"IF(T24=1,COUNTIF($T$3:T24,1),\"\")","v":""},{"$f":"IFERROR(INDEX($S$3:$S$281,MATCH(ROWS($U$3:U24),$U$3:$U$281,0)),\"\")","v":""},{"$f":"IFERROR(INDEX($S$3:$S$281,MATCH(ROWS($U$3:V24),$U$3:$U$281,0)),\"\")","v":""},{"$f":"IFERROR(INDEX($S$3:$S$281,MATCH(ROWS($U$3:U24),$U$3:$U$281,0)),\"\")","v":""},null,{"$f":"$V$3:INDEX($V$3:$V$281,MAX($U$3:$U$281),1)","v":"Saltspring Island"}]
[null,"Environment Canada Precipitation (mm)                             ",{"$f":"VLOOKUP($K$2,'Rainfall Data'!$A$4:$O$271,2,FALSE)","v":162},{"$f":"VLOOKUP($K$2,'Rainfall Data'!$A$4:$O$271,3,FALSE)","v":99},{"$f":"VLOOKUP($K$2,'Rainfall Data'!$A$4:$O$271,4,FALSE)","v":89},{"$f":"VLOOKUP($K$2,'Rainfall Data'!$A$4:$O$271,5,FALSE)","v":57},{"$f":"VLOOKUP($K$2,'Rainfall Data'!$A$4:$O$271,6,FALSE)","v":43},{"$f":"VLOOKUP($K$2,'Rainfall Data'!$A$4:$O$271,7,FALSE)","v":37},{"$f":"VLOOKUP($K$2,'Rainfall Data'!$A$4:$O$271,8,FALSE)","v":23},{"$f":"VLOOKUP($K$2,'Rainfall Data'!$A$4:$O$271,9,FALSE)","v":28},{"$f":"VLOOKUP($K$2,'Rainfall Data'!$A$4:$O$271,10,FALSE)","v":33},{"$f":"VLOOKUP($K$2,'Rainfall Data'!$A$4:$O$271,11,FALSE)","v":94},{"$f":"VLOOKUP($K$2,'Rainfall Data'!$A$4:$O$271,12,FALSE)","v":168},{"$f":"VLOOKUP($K$2,'Rainfall Data'!$A$4:$O$271,13,FALSE)","v":154},{"$f":"SUM(#REF!)","v":{"$error":"#REF!"}},null,null,null,"Annapolis Royal",0,{"$f":"IF(T25=1,COUNTIF($T$3:T25,1),\"\")","v":""},{"$f":"IFERROR(INDEX($S$3:$S$281,MATCH(ROWS($U$3:U25),$U$3:$U$281,0)),\"\")","v":""},{"$f":"IFERROR(INDEX($S$3:$S$281,MATCH(ROWS($U$3:V25),$U$3:$U$281,0)),\"\")","v":""},{"$f":"IFERROR(INDEX($S$3:$S$281,MATCH(ROWS($U$3:U25),$U$3:$U$281,0)),\"\")","v":""},null,{"$f":"$V$3:INDEX($V$3:$V$281,MAX($U$3:$U$281),1)","v":"Saltspring Island"}]
[null,"mm to Inches & inches  to Gallon",{"$f":"(C25/25.4)*(6.24/12)","v":3.3165354330708663},2.0267716535433071,1.8220472440944881,1.1669291338582677,0.88031496062992132,0.75748031496062995,0.47086614173228353,0.57322834645669296,0.67559055118110245,1.9244094488188976,3.4393700787401578,3.1527559055118117,{"$f":"SUM(CheckList14[[#This Row],[JAN]:[DEC]])","v":20.206299212598424},null,null,null,"Atikokan",0,{"$f":"IF(T26=1,COUNTIF($T$3:T26,1),\"\")","v":""},{"$f":"IFERROR(INDEX($S$3:$S$281,MATCH(ROWS($U$3:U26),$U$3:$U$281,0)),\"\")","v":""},{"$f":"IFERROR(INDEX($S$3:$S$281,MATCH(ROWS($U$3:V26),$U$3:$U$281,0)),\"\")","v":""},{"$f":"IFERROR(INDEX($S$3:$S$281,MATCH(ROWS($U$3:U26),$U$3:$U$281,0)),\"\")","v":""},null,{"$f":"$V$3:INDEX($V$3:$V$281,MAX($U$3:$U$281),1)","v":"Saltspring Island"}]
[null,"Precipitation Received from Roof (imp gals)",{"$f":"($C$37*C26)*$C$38","v":6633.0708661417339},4053.5433070866147,3644.0944881889768,2333.8582677165355,1760.6299212598428,1514.9606299212601,941.7322834645671,1146.456692913386,1351.1811023622049,3848.8188976377955,6878.7401574803152,6305.5118110236235,{"$f":"SUM(CheckList14[[#This Row],[JAN]:[DEC]])","v":40412.598425196862},null,null,null,"Atlin",0,{"$f":"IF(T27=1,COUNTIF($T$3:T27,1),\"\")","v":""},{"$f":"IFERROR(INDEX($S$3:$S$281,MATCH(ROWS($U$3:U27),$U$3:$U$281,0)),\"\")","v":""},{"$f":"IFERROR(INDEX($S$3:$S$281,MATCH(ROWS($U$3:V27),$U$3:$U$281,0)),\"\")","v":""},{"$f":"IFERROR(INDEX($S$3:$S$281,MATCH(ROWS($U$3:U27),$U$3:$U$281,0)),\"\")","v":""},null,{"$f":"$V$3:INDEX($V$3:$V$281,MAX($U$3:$U$281),1)","v":"Saltspring Island"}]
[null,"Start of Month in Storage (imp gals) (Last Dec.)        ",{"$f":"N17","v":9533.0708661417339},{"$f":"IF(C34>0,(C34),(0))","v":10000},{"$f":"IF(D34>0,(D34),(0))","v":10000},{"$f":"IF(E34>0,(E34),(0))","v":10000},{"$f":"IF(F34>0,(F34),(0))","v":9833.8582677165359},{"$f":"IF(G34>0,(G34),(0))","v":9094.4881889763783},{"$f":"IF(H34>0,(H34),(0))","v":8109.4488188976393},{"$f":"IF(I34>0,(I34),(0))","v":4551.1811023622067},{"$f":"IF(J34>0,(J34),(0))","v":1197.6377952755929},{"$f":"IF(K34>0,(K34),(0))","v":0},{"$f":"IF(L34>0,(L34),(0))","v":1348.8188976377955},{"$f":"IF(M34>0,(M34),(0))","v":5727.5590551181103},null,null,null,null,"Baddeck",0,{"$f":"IF(T28=1,COUNTIF($T$3:T28,1),\"\")","v":""},{"$f":"IFERROR(INDEX($S$3:$S$281,MATCH(ROWS($U$3:U28),$U$3:$U$281,0)),\"\")","v":""},{"$f":"IFERROR(INDEX($S$3:$S$281,MATCH(ROWS($U$3:V28),$U$3:$U$281,0)),\"\")","v":""},{"$f":"IFERROR(INDEX($S$3:$S$281,MATCH(ROWS($U$3:U28),$U$3:$U$281,0)),\"\")","v":""},null,{"$f":"$V$3:INDEX($V$3:$V$281,MAX($U$3:$U$281),1)","v":"Saltspring Island"}]
[null,"Household Usage (imp gals)                        ",2500,2500,2500,2500,2500,2500,2500,2500,2500,2500,2500,2500,{"$f":"SUM(CheckList14[[#This Row],[JAN]:[DEC]])","v":30000},null,null,null,"Baie Verte",0,{"$f":"IF(T29=1,COUNTIF($T$3:T29,1),\"\")","v":""},{"$f":"IFERROR(INDEX($S$3:$S$281,MATCH(ROWS($U$3:U29),$U$3:$U$281,0)),\"\")","v":""},{"$f":"IFERROR(INDEX($S$3:$S$281,MATCH(ROWS($U$3:V29),$U$3:$U$281,0)),\"\")","v":""},{"$f":"IFERROR(INDEX($S$3:$S$281,MATCH(ROWS($U$3:U29),$U$3:$U$281,0)),\"\")","v":""},null,{"$f":"$V$3:INDEX($V$3:$V$281,MAX($U$3:$U$281),1)","v":"Saltspring Island"}]
[null,"Irrigation/Outside Usage (imp gals) (make-up)                           ",null,null,null,null,null,null,2000,2000,2000,null,null,null,{"$f":"SUM(CheckList14[[#This Row],[JAN]:[DEC]])","v":6000},null,null,null,"Baie-Comeau",0,{"$f":"IF(T30=1,COUNTIF($T$3:T30,1),\"\")","v":""},{"$f":"IFERROR(INDEX($S$3:$S$281,MATCH(ROWS($U$3:U30),$U$3:$U$281,0)),\"\")","v":""},{"$f":"IFERROR(INDEX($S$3:$S$281,MATCH(ROWS($U$3:V30),$U$3:$U$281,0)),\"\")","v":""},{"$f":"IFERROR(INDEX($S$3:$S$281,MATCH(ROWS($U$3:U30),$U$3:$U$281,0)),\"\")","v":""},null,{"$f":"$V$3:INDEX($V$3:$V$281,MAX($U$3:$U$281),1)","v":"Saltspring Island"}]
{"$rows_left_out":252}
{"sheet":"Rainfall Data","index":1,"n_rows":271,"n_cols":13,"rows_kept":271,"cut":false,"hidden":true,"merged":[[1,0,1,1]]}
[]
[]
["Place","JAN","FEB","MAR","APR","MAY","JUN","JUL","AUG","SEPT","OCT","NOV","DEC"]
["Abbotsford",212,132,149,118,100,75,43,46,75,153,248,187]
["Alberton",96,74,81,80,93,82,86,80,92,96,99,94]
["Alliston",93,79,75,96,83,94,89,75,128,127,123,117]
["Amherst - Nappan",106,83,105,92,101,83,89,74,102,103,111,107]
["Amos",56,36,50,65,87,94,112,98,107,87,79,58]
["Annapolis Royal",114,85,94,95,86,74,69,69,110,120,125,113]
["Atikokan",35,25,33,50,77,104,118,88,100,76,45,36]
["Atlin",46,25,17,9,18,30,33,34,42,37,36,36]
["Baddeck",155,126,129,126,104,105,97,107,128,137,155,166]
["Baie Verte",104,87,75,74,79,108,86,115,92,112,88,96]
["Baie-Comeau",83,65,68,80,91,89,93,75,86,95,96,79]
["Baltic",116,91,96,93,93,101,87,104,115,122,126,129]
["Banff",20,17,21,34,62,68,68,62,39,32,26,21]
["Bangor",120,99,99,94,96,94,82,96,112,120,129,141]
["Barkerville",96,61,66,58,78,102,100,81,82,92,111,95]
["Barrie",83,62,58,62,82,85,77,90,94,78,89,74]
["Bathurst",98,68,73,91,77,92,96,118,72,84,107,95]
["Bella Coola",157,88,76,56,48,51,42,60,90,195,205,131]
["Belleville",67,58,62,76,81,74,65,75,92,85,96,79]
["Big Trout Lake",22,19,31,33,40,80,85,89,90,50,55,28]
["Blanc-Sablon",97,84,80,50,69,92,102,96,89,88,75,100]
["Bonavista",101,104,103,83,76,90,82,79,108,115,105,107]
["Brandon",18,13,25,26,59,81,73,66,44,30,19,21]
["Brantford",55,51,59,69,81,76,95,75,87,70,84,65]
["Bridgewater",144,120,156,127,128,104,97,100,111,137,165,148]
["Brooks",13,9,19,22,35,74,26,38,29,11,13,12]
["Buctouche",104,88,93,86,101,95,99,85,86,95,103,101]
{"$rows_left_out":242}
{"sheet":"Rainfall Data (2)","index":2,"n_rows":271,"n_cols":13,"rows_kept":271,"cut":false,"hidden":true,"merged":[[1,0,1,1]]}
[]
[]
["Place","JAN","FEB","MAR","APR","MAY","JUN","JUL","AUG","SEPT","OCT","NOV","DEC"]
["Abbotsford",212,132,149,118,100,75,43,46,75,153,248,187]
["Atlin",46,25,17,9,18,30,33,34,42,37,36,36]
["Barkerville",96,61,66,58,78,102,100,81,82,92,111,95]
["Bella Coola",157,88,76,56,48,51,42,60,90,195,205,131]
["Campbell River",217,149,140,92,68,63,39,45,55,162,232,226]
["Castlegar",76,51,63,59,70,72,48,30,42,51,97,90]
["Chilliwack",233,126,155,116,93,92,48,57,75,178,284,210]
["Cortes Island, Whaletown",184,131,107,100,73,70,49,55,61,155,224,181]
["Courtenay - Comox",172,114,106,65,46,43,27,29,42,123,201,188]
["Cranbrook",26,19,22,25,46,62,38,28,31,20,35,33]
["Duncan",277,146,154,81,56,41,23,35,41,153,247,254]
["Fort Nelson",21,15,19,19,49,63,78,71,40,33,26,18]
["Fort St John",25,19,24,20,38,66,75,51,45,31,29,22]
["Gabriola Island",147,96,92,63,48,43,24,27,34,86,157,141]
["Gibsons",183,110,125,104,91,67,41,49,60,152,213,174]
["Gold River",424,286,266,187,120,91,56,71,109,359,491,391]
["Golden",46,24,24,24,34,50,51,45,38,35,51,44]
["Kamloops",21,12,13,14,27,37,31,24,29,19,23,25]
["Kelowna",30,20,21,24,31,40,33,26,27,24,35,32]
["Lillooet",38,20,17,19,26,24,36,26,24,34,44,42]
["Mayne Island, Village Bay",130,88,75,55,44,37,21,24,28,80,135,125]
["Nanaimo",188,126,113,67,54,43,25,28,36,102,197,184]
["North Vancouver, Capilano",330,279,218,207,132,124,61,72,98,248,437,316]
["Penticton",27,20,24,26,39,46,29,28,25,26,28,29]
["Port Alberni",291,255,190,127,79,55,26,38,49,204,317,276]
["Port Hardy",247,160,160,125,79,81,54,73,110,257,312,251]
["Port Renfrew",556,377,362,259,155,108,51,82,124,371,580,481]
{"$rows_left_out":241}