{"text_format":"1","workbook":"xlsx","n_sheets":3,"sheets":["RAIN-TANK 2017","Rainfall Data","Rainfall Data (2)"],"not_rendered":{"charts":0,"images":4,"macros":1,"external_links":0,"defined_names":19,"comments":0,"pivot_tables":0},"unopened":[],"bounds":{"document_bytes":16777216,"sheet_cells":100000,"rows_first":2000,"rows_last":500,"rows_between":2000,"halvings":0,"cell_chars":16384,"cell_head_chars":4096},"cells_cut":0,"cells_raw":0,"read":"whole","date_system":"1900"}

{"sheet":"RAIN-TANK 2017","index":0,"n_rows":281,"n_cols":26,"rows_kept":281,"cut":false,"hidden":false,"merged":[[4,2,4,14],[3,9,3,10],[1,7,1,8],[2,7,2,8],[21,2,21,14]]}
[]
[null,"RAINWATER HARVESTING STORAGE WORKSHEET ",null,null,null,null,null,"WEATHER STATION:",null,null,"Saltspring Island",null,null,null,null,null,null,null,"Country"]
[null,"Optimize your storage volume",null,null,null,null,null,"PROJECT NAME:",null,"Test",null,null,null,null,null,null,null,null,"Abbotsford",{"$f":"--ISNUMBER(IFERROR(SEARCH($K$2,S3,1),\"\"))","v":0},{"$f":"IF(T3=1,COUNTIF($T$3:T3,1),\"\")","v":""},{"$f":"IFERROR(INDEX($S$3:$S$281,MATCH(ROWS($U$3:U3),$U$3:$U$281,0)),\"\")","v":"Saltspring Island"},{"$f":"IFERROR(INDEX($S$3:$S$281,MATCH(ROWS($U$3:V3),$U$3:$U$281,0)),\"\")","v":"Saltspring Island"},{"$f":"IFERROR(INDEX($S$3:$S$281,MATCH(ROWS($U$3:U3),$U$3:$U$281,0)),\"\")","v":"Saltspring Island"},null,{"$f":"$V$3:INDEX($V$3:$V$281,MAX($U$3:$U$281),1)","v":"Saltspring Island"}]
[null,null,null,null,null,null,null,"DATE:",null,"2017-07-20",null,null,null,null,null,null,null,null,"Alberton",{"$f":"--ISNUMBER(IFERROR(SEARCH($K$2,S4,1),\"\"))","v":0},{"$f":"IF(T4=1,COUNTIF($T$3:T4,1),\"\")","v":""},{"$f":"IFERROR(INDEX($S$3:$S$281,MATCH(ROWS($U$3:U4),$U$3:$U$281,0)),\"\")","v":""},{"$f":"IFERROR(INDEX($S$3:$S$281,MATCH(ROWS($U$3:V4),$U$3:$U$281,0)),\"\")","v":""},{"$f":"IFERROR(INDEX($S$3:$S$281,MATCH(ROWS($U$3:U4),$U$3:$U$281,0)),\"\")","v":""},null,{"$f":"$V$3:INDEX($V$3:$V$281,MAX($U$3:$U$281),1)","v":"Saltspring Island"}]
[null,null,"INPUTS",null,null,null,null,null,null,null,null,null,null,null,null,null,null,null,"Alliston",0,{"$f":"IF(T5=1,COUNTIF($T$3:T5,1),\"\")","v":""},{"$f":"IFERROR(INDEX($S$3:$S$281,MATCH(ROWS($U$3:U5),$U$3:$U$281,0)),\"\")","v":""},{"$f":"IFERROR(INDEX($S$3:$S$281,MATCH(ROWS($U$3:V5),$U$3:$U$281,0)),\"\")","v":""},{"$f":"IFERROR(INDEX($S$3:$S$281,MATCH(ROWS($U$3:U5),$U$3:$U$281,0)),\"\")","v":""},null,{"$f":"$V$3:INDEX($V$3:$V$281,MAX($U$3:$U$281),1)","v":"Saltspring Island"}]
[null,null,null,null,null,null,null,null,null,null,null,null,null,null,null,null,null,null,"Amherst - Nappan",0,{"$f":"IF(T6=1,COUNTIF($T$3:T6,1),\"\")","v":""},{"$f":"IFERROR(INDEX($S$3:$S$281,MATCH(ROWS($U$3:U6),$U$3:$U$281,0)),\"\")","v":""},{"$f":"IFERROR(INDEX($S$3:$S$281,MATCH(ROWS($U$3:V6),$U$3:$U$281,0)),\"\")","v":""},{"$f":"IFERROR(INDEX($S$3:$S$281,MATCH(ROWS($U$3:U6),$U$3:$U$281,0)),\"\")","v":""},null,{"$f":"$V$3:INDEX($V$3:$V$281,MAX($U$3:$U$281),1)","v":"Saltspring Island"}]
[null,"MONTH","JAN","FEB","MAR","APR","MAY","JUN","JUL","AUG","SEPT","OCT","NOV","DEC","TOTAL","Column1",null,null,"Amos",0,{"$f":"IF(T7=1,COUNTIF($T$3:T7,1),\"\")","v":""},{"$f":"IFERROR(INDEX($S$3:$S$281,MATCH(ROWS($U$3:U7),$U$3:$U$281,0)),\"\")","v":""},{"$f":"IFERROR(INDEX($S$3:$S$281,MATCH(ROWS($U$3:V7),$U$3:$U$281,0)),\"\")","v":""},{"$f":"IFERROR(INDEX($S$3:$S$281,MATCH(ROWS($U$3:U7),$U$3:$U$281,0)),\"\")","v":""},null,{"$f":"$V$3:INDEX($V$3:$V$281,MAX($U$3:$U$281),1)","v":"Saltspring Island"}]
[null,"Environment Canada Precipitation (mm)                             ",{"$f":"VLOOKUP($K$2,'Rainfall Data'!$A$4:$O$271,2,FALSE)","v":162},{"$f":"VLOOKUP($K$2,'Rainfall Data'!$A$4:$O$271,3,FALSE)","v":99},{"$f":"VLOOKUP($K$2,'Rainfall Data'!$A$4:$O$271,4,FALSE)","v":89},{"$f":"VLOOKUP($K$2,'Rainfall Data'!$A$4:$O$271,5,FALSE)","v":57},{"$f":"VLOOKUP($K$2,'Rainfall Data'!$A$4:$O$271,6,FALSE)","v":43},{"$f":"VLOOKUP($K$2,'Rainfall Data'!$A$4:$O$271,7,FALSE)","v":37},{"$f":"VLOOKUP($K$2,'Rainfall Data'!$A$4:$O$271,8,FALSE)","v":23},{"$f":"VLOOKUP($K$2,'Rainfall Data'!$A$4:$O$271,9,FALSE)","v":28},{"$f":"VLOOKUP($K$2,'Rainfall Data'!$A$4:$O$271,10,FALSE)","v":33},{"$f":"VLOOKUP($K$2,'Rainfall Data'!$A$4:$O$271,11,FALSE)","v":94},{"$f":"VLOOKUP($K$2,'Rainfall Data'!$A$4:$O$271,12,FALSE)","v":168},{"$f":"VLOOKUP($K$2,'Rainfall Data'!$A$4:$O$271,13,FALSE)","v":154},{"$f":"SUM(CheckList1[[#This Row],[JAN]:[DEC]])","v":987},null,null,null,"Annapolis Royal",0,{"$f":"IF(T8=1,COUNTIF($T$3:T8,1),\"\")","v":""},{"$f":"IFERROR(INDEX($S$3:$S$281,MATCH(ROWS($U$3:U8),$U$3:$U$281,0)),\"\")","v":""},{"$f":"IFERROR(INDEX($S$3:$S$281,MATCH(ROWS($U$3:V8),$U$3:$U$281,0)),\"\")","v":""},{"$f":"IFERROR(INDEX($S$3:$S$281,MATCH(ROWS($U$3:U8),$U$3:$U$281,0)),\"\")","v":""},null,{"$f":"$V$3:INDEX($V$3:$V$281,MAX($U$3:$U$281),1)","v":"Saltspring Island"}]
[null,"mm to Inches & inches  to Gallon",{"$f":"(C8/25.4)*(6.24/12)","v":3.3165354330708663},2.0267716535433071,1.8220472440944881,1.1669291338582677,0.88031496062992132,0.75748031496062995,0.47086614173228353,0.57322834645669296,0.67559055118110245,1.9244094488188976,3.4393700787401578,3.1527559055118117,{"$f":"SUM(CheckList1[[#This Row],[JAN]:[DEC]])","v":20.206299212598424},null,null,null,"Atikokan",0,{"$f":"IF(T9=1,COUNTIF($T$3:T9,1),\"\")","v":""},{"$f":"IFERROR(INDEX($S$3:$S$281,MATCH(ROWS($U$3:U9),$U$3:$U$281,0)),\"\")","v":""},{"$f":"IFERROR(INDEX($S$3:$S$281,MATCH(ROWS($U$3:V9),$U$3:$U$281,0)),\"\")","v":""},{"$f":"IFERROR(INDEX($S$3:$S$281,MATCH(ROWS($U$3:U9),$U$3:$U$281,0)),\"\")","v":""},null,{"$f":"$V$3:INDEX($V$3:$V$281,MAX($U$3:$U$281),1)","v":"Saltspring Island"}]
[null,"Precipitation Received from Roof (imp gals)",{"$f":"($C$37*C9)*$C$38","v":6633.0708661417339},4053.5433070866147,3644.0944881889768,2333.8582677165355,1760.6299212598428,1514.9606299212601,941.7322834645671,1146.456692913386,1351.1811023622049,3848.8188976377955,6878.7401574803152,6305.5118110236235,{"$f":"SUM(CheckList1[[#This Row],[JAN]:[DEC]])","v":40412.598425196862},null,null,null,"Atlin",0,{"$f":"IF(T10=1,COUNTIF($T$3:T10,1),\"\")","v":""},{"$f":"IFERROR(INDEX($S$3:$S$281,MATCH(ROWS($U$3:U10),$U$3:$U$281,0)),\"\")","v":""},{"$f":"IFERROR(INDEX($S$3:$S$281,MATCH(ROWS($U$3:V10),$U$3:$U$281,0)),\"\")","v":""},{"$f":"IFERROR(INDEX($S$3:$S$281,MATCH(ROWS($U$3:U10),$U$3:$U$281,0)),\"\")","v":""},null,{"$f":"$V$3:INDEX($V$3:$V$281,MAX($U$3:$U$281),1)","v":"Saltspring Island"}]
[null,"Start of Month in Storage (imp gals) (Last Dec.)        ",null,{"$f":"IF(C17>0,(C17),(0))","v":4133.0708661417339},{"$f":"IF(D17>0,(D17),(0))","v":5686.6141732283486},6830.7086614173259,6664.5669291338618,5925.1968503937042,4940.1574803149642,1381.8897637795317,0,0,1348.8188976377955,5727.5590551181103,null,null,null,null,"Baddeck",0,{"$f":"IF(T11=1,COUNTIF($T$3:T11,1),\"\")","v":""},{"$f":"IFERROR(INDEX($S$3:$S$281,MATCH(ROWS($U$3:U11),$U$3:$U$281,0)),\"\")","v":""},{"$f":"IFERROR(INDEX($S$3:$S$281,MATCH(ROWS($U$3:V11),$U$3:$U$281,0)),\"\")","v":""},{"$f":"IFERROR(INDEX($S$3:$S$281,MATCH(ROWS($U$3:U11),$U$3:$U$281,0)),\"\")","v":""},null,{"$f":"$V$3:INDEX($V$3:$V$281,MAX($U$3:$U$281),1)","v":"Saltspring Island"}]
[null,"Household Usage (imp gals)                        ",2500,2500,2500,2500,2500,2500,2500,2500,2500,2500,2500,2500,{"$f":"SUM(CheckList1[[#This Row],[JAN]:[DEC]])","v":30000},null,null,null,"Baie Verte",0,{"$f":"IF(T12=1,COUNTIF($T$3:T12,1),\"\")","v":""},{"$f":"IFERROR(INDEX($S$3:$S$281,MATCH(ROWS($U$3:U12),$U$3:$U$281,0)),\"\")","v":""},{"$f":"IFERROR(INDEX($S$3:$S$281,MATCH(ROWS($U$3:V12),$U$3:$U$281,0)),\"\")","v":""},{"$f":"IFERROR(INDEX($S$3:$S$281,MATCH(ROWS($U$3:U12),$U$3:$U$281,0)),\"\")","v":""},null,{"$f":"$V$3:INDEX($V$3:$V$281,MAX($U$3:$U$281),1)","v":"Saltspring Island"}]
[null,"Irrigation/Outside Usage (imp gals) (make-up)                           ",null,null,null,null,null,null,2000,2000,2000,null,null,null,{"$f":"SUM(CheckList1[[#This Row],[JAN]:[DEC]])","v":6000},null,null,null,"Baie-Comeau",0,{"$f":"IF(T13=1,COUNTIF($T$3:T13,1),\"\")","v":""},{"$f":"IFERROR(INDEX($S$3:$S$281,MATCH(ROWS($U$3:U13),$U$3:$U$281,0)),\"\")","v":""},{"$f":"IFERROR(INDEX($S$3:$S$281,MATCH(ROWS($U$3:V13),$U$3:$U$281,0)),\"\")","v":""},{"$f":"IFERROR(INDEX($S$3:$S$281,MATCH(ROWS($U$3:U13),$U$3:$U$281,0)),\"\")","v":""},null,{"$f":"$V$3:INDEX($V$3:$V$281,MAX($U$3:$U$281),1)","v":"Saltspring Island"}]
[null,"Total Usage  (imp gals)",{"$f":"C13+C12","v":2500},{"$f":"D13+D12","v":2500},2500,2500,2500,2500,4500,4500,4500,2500,2500,2500,{"$f":"SUM(CheckList1[[#This Row],[JAN]:[DEC]])","v":36000},null,null,null,"Baltic",0,{"$f":"IF(T14=1,COUNTIF($T$3:T14,1),\"\")","v":""},{"$f":"IFERROR(INDEX($S$3:$S$281,MATCH(ROWS($U$3:U14),$U$3:$U$281,0)),\"\")","v":""},{"$f":"IFERROR(INDEX($S$3:$S$281,MATCH(ROWS($U$3:V14),$U$3:$U$281,0)),\"\")","v":""},{"$f":"IFERROR(INDEX($S$3:$S$281,MATCH(ROWS($U$3:U14),$U$3:$U$281,0)),\"\")","v":""},null,{"$f":"$V$3:INDEX($V$3:$V$281,MAX($U$3:$U$281),1)","v":"Saltspring Island"}]
[null,"End of Month (no Storage Limit) (imp gals)",{"$f":"C10+C11-C14","v":4133.0708661417339},5686.6141732283486,6830.7086614173259,6664.5669291338618,5925.1968503937042,4940.1574803149642,1381.8897637795317,-1971.6535433070821,-3148.8188976377951,1348.8188976377955,5727.5590551181103,9533.0708661417339,null,{"$f":"SUM(CheckList1[[#This Row],[JAN]:[DEC]])","v":47051.181102362229},null,null,"Banff",0,{"$f":"IF(T15=1,COUNTIF($T$3:T15,1),\"\")","v":""},{"$f":"IFERROR(INDEX($S$3:$S$281,MATCH(ROWS($U$3:U15),$U$3:$U$281,0)),\"\")","v":""},{"$f":"IFERROR(INDEX($S$3:$S$281,MATCH(ROWS($U$3:V15),$U$3:$U$281,0)),\"\")","v":""},{"$f":"IFERROR(INDEX($S$3:$S$281,MATCH(ROWS($U$3:U15),$U$3:$U$281,0)),\"\")","v":""},null,{"$f":"$V$3:INDEX($V$3:$V$281,MAX($U$3:$U$281),1)","v":"Saltspring Island"}]
[null,"Overflow Volume - wastage  (imp gals)",{"$f":"C15-C17","v":0},{"$f":"D15-D17","v":0},0,0,0,0,0,0,0,0,0,0,{"$f":"SUM(CheckList1[[#This Row],[JAN]:[DEC]])","v":0}]
[null,"End of Month in Storage (imp gals) (make-up)",{"$f":"IF(C15>$C$36,($C$36),(C15))","v":4133.0708661417339},5686.6141732283486,6830.7086614173259,6664.5669291338618,5925.1968503937042,4940.1574803149642,1381.8897637795317,-1971.6535433070821,-3148.8188976377951,1348.8188976377955,5727.5590551181103,9533.0708661417339,null,{"$f":"SUM(CheckList1[[#This Row],[JAN]:[DEC]])","v":47051.181102362229},null,null,"Bangor",0,{"$f":"IF(T17=1,COUNTIF($T$3:T17,1),\"\")","v":""},{"$f":"IFERROR(INDEX($S$3:$S$281,MATCH(ROWS($U$3:U17),$U$3:$U$281,0)),\"\")","v":""},{"$f":"IFERROR(INDEX($S$3:$S$281,MATCH(ROWS($U$3:V17),$U$3:$U$281,0)),\"\")","v":""},{"$f":"IFERROR(INDEX($S$3:$S$281,MATCH(ROWS($U$3:U17),$U$3:$U$281,0)),\"\")","v":""},null,{"$f":"$V$3:INDEX($V$3:$V$281,MAX($U$3:$U$281),1)","v":"Saltspring Island"}]
[null,"ANNUAL OVERFLOW VOLUME (WASTAGE)",{"$f":"100%-((O10-(P15-P17))/O10)","v":0},null,null,null,null,null,null,null,null,null,null,null,null,null,null,null,"Barkerville",0,{"$f":"IF(T18=1,COUNTIF($T$3:T18,1),\"\")","v":""},{"$f":"IFERROR(INDEX($S$3:$S$281,MATCH(ROWS($U$3:U18),$U$3:$U$281,0)),\"\")","v":""},{"$f":"IFERROR(INDEX($S$3:$S$281,MATCH(ROWS($U$3:V18),$U$3:$U$281,0)),\"\")","v":""},{"$f":"IFERROR(INDEX($S$3:$S$281,MATCH(ROWS($U$3:U18),$U$3:$U$281,0)),\"\")","v":""},null,{"$f":"$V$3:INDEX($V$3:$V$281,MAX($U$3:$U$281),1)","v":"Saltspring Island"}]
[null,"ANNUAL MAKE-UP WATER (SHORTFALL) ",{"$f":"(IF(C15<0,($C15),(0))+IF(D15<0,($D15),(0))+IF(E15<0,($E15),(0))+IF(F15<0,($F15),(0))+IF(G15<0,($G15),(0))+IF(H15<0,($H15),(0))+IF(I15<0,($I15),(0))+IF(J15<0,($J15),(0))+IF(K15<0,($K15),(0))+IF(L15<0,($L15),(0))+IF(M15<0,($M15),(0))+IF(N15<0,($N15),(0)))/O14","v":-0.14223534558180215},null,null,null,null,null,null,null,null,null,null,null,null,null,null,null,"Barrie",0,{"$f":"IF(T19=1,COUNTIF($T$3:T19,1),\"\")","v":""},{"$f":"IFERROR(INDEX($S$3:$S$281,MATCH(ROWS($U$3:U19),$U$3:$U$281,0)),\"\")","v":""},{"$f":"IFERROR(INDEX($S$3:$S$281,MATCH(ROWS($U$3:V19),$U$3:$U$281,0)),\"\")","v":""},{"$f":"IFERROR(INDEX($S$3:$S$281,MATCH(ROWS($U$3:U19),$U$3:$U$281,0)),\"\")","v":""},null,{"$f":"$V$3:INDEX($V$3:$V$281,MAX($U$3:$U$281),1)","v":"Saltspring Island"}]
[null,null,null,null,null,null,null,null,null,null,null,null,null,null,null,null,null,null,"Bathurst",0,{"$f":"IF(T20=1,COUNTIF($T$3:T20,1),\"\")","v":""},{"$f":"IFERROR(INDEX($S$3:$S$281,MATCH(ROWS($U$3:U20),$U$3:$U$281,0)),\"\")","v":""},{"$f":"IFERROR(INDEX($S$3:$S$281,MATCH(ROWS($U$3:V20),$U$3:$U$281,0)),\"\")","v":""},{"$f":"IFERROR(INDEX($S$3:$S$281,MATCH(ROWS($U$3:U20),$U$3:$U$281,0)),\"\")","v":""},null,{"$f":"$V$3:INDEX($V$3:$V$281,MAX($U$3:$U$281),1)","v":"Saltspring Island"}]
[null,null,null,null,null,null,null,null,null,null,null,null,null,null,null,null,null,null,"Blanc-Sablon",0,{"$f":"IF(T21=1,COUNTIF($T$3:T21,1),\"\")","v":""},{"$f":"IFERROR(INDEX($S$3:$S$281,MATCH(ROWS($U$3:U21),$U$3:$U$281,0)),\"\")","v":""},{"$f":"IFERROR(INDEX($S$3:$S$281,MATCH(ROWS($U$3:V21),$U$3:$U$281,0)),\"\")","v":""},{"$f":"IFERROR(INDEX($S$3:$S$281,MATCH(ROWS($U$3:U21),$U$3:$U$281,0)),\"\")","v":""},null,{"$f":"$V$3:INDEX($V$3:$V$281,MAX($U$3:$U$281),1)","v":"Saltspring Island"}]
[null,null,"OUTPUTS",null,null,null,null,null,null,null,null,null,null,null,null,null,null,null,"Alliston",{"$f":"--ISNUMBER(IFERROR(SEARCH($K$2,S22,1),\"\"))","v":0},{"$f":"IF(T22=1,COUNTIF($T$3:T22,1),\"\")","v":""},{"$f":"IFERROR(INDEX($S$3:$S$281,MATCH(ROWS($U$3:U22),$U$3:$U$281,0)),\"\")","v":""},{"$f":"IFERROR(INDEX($S$3:$S$281,MATCH(ROWS($U$3:V22),$U$3:$U$281,0)),\"\")","v":""},{"$f":"IFERROR(INDEX($S$3:$S$281,MATCH(ROWS($U$3:U22),$U$3:$U$281,0)),\"\")","v":""},null,{"$f":"$V$3:INDEX($V$3:$V$281,MAX($U$3:$U$281),1)","v":"Saltspring Island"}]
[null,null,null,null,null,null,null,null,null,null,null,null,null,null,null,null,null,null,"Amherst - Nappan",0,{"$f":"IF(T23=1,COUNTIF($T$3:T23,1),\"\")","v":""},{"$f":"IFERROR(INDEX($S$3:$S$281,MATCH(ROWS($U$3:U23),$U$3:$U$281,0)),\"\")","v":""},{"$f":"IFERROR(INDEX($S$3:$S$281,MATCH(ROWS($U$3:V23),$U$3:$U$281,0)),\"\")","v":""},{"$f":"IFERROR(INDEX($S$3:$S$281,MATCH(ROWS($U$3:U23),$U$3:$U$281,0)),\"\")","v":""},null,{"$f":"$V$3:INDEX($V$3:$V$281,MAX($U$3:$U$281),1)","v":"Saltspring Island"}]
[null,"MONTH","JAN","FEB","MAR","APR","MAY","JUN","JUL","AUG","SEPT","OCT","NOV","DEC","TOTAL","Column1",null,null,"Amos",0,{"$f":"IF(T24=1,COUNTIF($T$3:T24,1),\"\")","v":""},{"$f":"IFERROR(INDEX($S$3:$S$281,MATCH(ROWS($U$3:U24),$U$3:$U$281,0)),\"\")","v":""},{"$f":"IFERROR(INDEX($S$3:$S$281,MATCH(ROWS($U$3:V24),$U$3:$U$281,0)),\"\")","v":""},{"$f":"IFERROR(INDEX($S$3:$S$281,MATCH(ROWS($U$3:U24),$U$3:$U$281,0)),\"\")","v":""},null,{"$f":"$V$3:INDEX($V$3:$V$281,MAX($U$3:$U$281),1)","v":"Saltspring Island"}]
[null,"Environment Canada Precipitation (mm)                             ",{"$f":"VLOOKUP($K$2,'Rainfall Data'!$A$4:$O$271,2,FALSE)","v":162},{"$f":"VLOOKUP($K$2,'Rainfall Data'!$A$4:$O$271,3,FALSE)","v":99},{"$f":"VLOOKUP($K$2,'Rainfall Data'!$A$4:$O$271,4,FALSE)","v":89},{"$f":"VLOOKUP($K$2,'Rainfall Data'!$A$4:$O$271,5,FALSE)","v":57},{"$f":"VLOOKUP($K$2,'Rainfall Data'!$A$4:$O$271,6,FALSE)","v":43},{"$f":"VLOOKUP($K$2,'Rainfall Data'!$A$4:$O$271,7,FALSE)","v":37},{"$f":"VLOOKUP($K$2,'Rainfall Data'!$A$4:$O$271,8,FALSE)","v":23},{"$f":"VLOOKUP($K$2,'Rainfall Data'!$A$4:$O$271,9,FALSE)","v":28},{"$f":"VLOOKUP($K$2,'Rainfall Data'!$A$4:$O$271,10,FALSE)","v":33},{"$f":"VLOOKUP($K$2,'Rainfall Data'!$A$4:$O$271,11,FALSE)","v":94},{"$f":"VLOOKUP($K$2,'Rainfall Data'!$A$4:$O$271,12,FALSE)","v":168},{"$f":"VLOOKUP($K$2,'Rainfall Data'!$A$4:$O$271,13,FALSE)","v":154},{"$f":"SUM(#REF!)","v":{"$error":"#REF!"}},null,null,null,"Annapolis Royal",0,{"$f":"IF(T25=1,COUNTIF($T$3:T25,1),\"\")","v":""},{"$f":"IFERROR(INDEX($S$3:$S$281,MATCH(ROWS($U$3:U25),$U$3:$U$281,0)),\"\")","v":""},{"$f":"IFERROR(INDEX($S$3:$S$281,MATCH(ROWS($U$3:V25),$U$3:$U$281,0)),\"\")","v":""},{"$f":"IFERROR(INDEX($S$3:$S$281,MATCH(ROWS($U$3:U25),$U$3:$U$281,0)),\"\")","v":""},null,{"$f":"$V$3:INDEX($V$3:$V$281,MAX($U$3:$U$281),1)","v":"Saltspring Island"}]
[null,"mm to Inches & inches  to Gallon",{"$f":"(C25/25.4)*(6.24/12)","v":3.3165354330708663},2.0267716535433071,1.8220472440944881,1.1669291338582677,0.88031496062992132,0.75748031496062995,0.47086614173228353,0.57322834645669296,0.67559055118110245,1.9244094488188976,3.4393700787401578,3.1527559055118117,{"$f":"SUM(CheckList14[[#This Row],[JAN]:[DEC]])","v":20.206299212598424},null,null,null,"Atikokan",0,{"$f":"IF(T26=1,COUNTIF($T$3:T26,1),\"\")","v":""},{"$f":"IFERROR(INDEX($S$3:$S$281,MATCH(ROWS($U$3:U26),$U$3:$U$281,0)),\"\")","v":""},{"$f":"IFERROR(INDEX($S$3:$S$281,MATCH(ROWS($U$3:V26),$U$3:$U$281,0)),\"\")","v":""},{"$f":"IFERROR(INDEX($S$3:$S$281,MATCH(ROWS($U$3:U26),$U$3:$U$281,0)),\"\")","v":""},null,{"$f":"$V$3:INDEX($V$3:$V$281,MAX($U$3:$U$281),1)","v":"Saltspring Island"}]
[null,"Precipitation Received from Roof (imp gals)",{"$f":"($C$37*C26)*$C$38","v":6633.0708661417339},4053.5433070866147,3644.0944881889768,2333.8582677165355,1760.6299212598428,1514.9606299212601,941.7322834645671,1146.456692913386,1351.1811023622049,3848.8188976377955,6878.7401574803152,6305.5118110236235,{"$f":"SUM(CheckList14[[#This Row],[JAN]:[DEC]])","v":40412.598425196862},null,null,null,"Atlin",0,{"$f":"IF(T27=1,COUNTIF($T$3:T27,1),\"\")","v":""},{"$f":"IFERROR(INDEX($S$3:$S$281,MATCH(ROWS($U$3:U27),$U$3:$U$281,0)),\"\")","v":""},{"$f":"IFERROR(INDEX($S$3:$S$281,MATCH(ROWS($U$3:V27),$U$3:$U$281,0)),\"\")","v":""},{"$f":"IFERROR(INDEX($S$3:$S$281,MATCH(ROWS($U$3:U27),$U$3:$U$281,0)),\"\")","v":""},null,{"$f":"$V$3:INDEX($V$3:$V$281,MAX($U$3:$U$281),1)","v":"Saltspring Island"}]
[null,"Start of Month in Storage (imp gals) (Last Dec.)        ",{"$f":"N17","v":9533.0708661417339},{"$f":"IF(C34>0,(C34),(0))","v":10000},{"$f":"IF(D34>0,(D34),(0))","v":10000},{"$f":"IF(E34>0,(E34),(0))","v":10000},{"$f":"IF(F34>0,(F34),(0))","v":9833.8582677165359},{"$f":"IF(G34>0,(G34),(0))","v":9094.4881889763783},{"$f":"IF(H34>0,(H34),(0))","v":8109.4488188976393},{"$f":"IF(I34>0,(I34),(0))","v":4551.1811023622067},{"$f":"IF(J34>0,(J34),(0))","v":1197.6377952755929},{"$f":"IF(K34>0,(K34),(0))","v":0},{"$f":"IF(L34>0,(L34),(0))","v":1348.8188976377955},{"$f":"IF(M34>0,(M34),(0))","v":5727.5590551181103},null,null,null,null,"Baddeck",0,{"$f":"IF(T28=1,COUNTIF($T$3:T28,1),\"\")","v":""},{"$f":"IFERROR(INDEX($S$3:$S$281,MATCH(ROWS($U$3:U28),$U$3:$U$281,0)),\"\")","v":""},{"$f":"IFERROR(INDEX($S$3:$S$281,MATCH(ROWS($U$3:V28),$U$3:$U$281,0)),\"\")","v":""},{"$f":"IFERROR(INDEX($S$3:$S$281,MATCH(ROWS($U$3:U28),$U$3:$U$281,0)),\"\")","v":""},null,{"$f":"$V$3:INDEX($V$3:$V$281,MAX($U$3:$U$281),1)","v":"Saltspring Island"}]
[null,"Household Usage (imp gals)                        ",2500,2500,2500,2500,2500,2500,2500,2500,2500,2500,2500,2500,{"$f":"SUM(CheckList14[[#This Row],[JAN]:[DEC]])","v":30000},null,null,null,"Baie Verte",0,{"$f":"IF(T29=1,COUNTIF($T$3:T29,1),\"\")","v":""},{"$f":"IFERROR(INDEX($S$3:$S$281,MATCH(ROWS($U$3:U29),$U$3:$U$281,0)),\"\")","v":""},{"$f":"IFERROR(INDEX($S$3:$S$281,MATCH(ROWS($U$3:V29),$U$3:$U$281,0)),\"\")","v":""},{"$f":"IFERROR(INDEX($S$3:$S$281,MATCH(ROWS($U$3:U29),$U$3:$U$281,0)),\"\")","v":""},null,{"$f":"$V$3:INDEX($V$3:$V$281,MAX($U$3:$U$281),1)","v":"Saltspring Island"}]
[null,"Irrigation/Outside Usage (imp gals) (make-up)                           ",null,null,null,null,null,null,2000,2000,2000,null,null,null,{"$f":"SUM(CheckList14[[#This Row],[JAN]:[DEC]])","v":6000},null,null,null,"Baie-Comeau",0,{"$f":"IF(T30=1,COUNTIF($T$3:T30,1),\"\")","v":""},{"$f":"IFERROR(INDEX($S$3:$S$281,MATCH(ROWS($U$3:U30),$U$3:$U$281,0)),\"\")","v":""},{"$f":"IFERROR(INDEX($S$3:$S$281,MATCH(ROWS($U$3:V30),$U$3:$U$281,0)),\"\")","v":""},{"$f":"IFERROR(INDEX($S$3:$S$281,MATCH(ROWS($U$3:U30),$U$3:$U$281,0)),\"\")","v":""},null,{"$f":"$V$3:INDEX($V$3:$V$281,MAX($U$3:$U$281),1)","v":"Saltspring Island"}]
[null,"Total Usage  (imp gals)",{"$f":"C30+C29","v":2500},{"$f":"D30+D29","v":2500},2500,2500,2500,2500,4500,4500,4500,2500,2500,2500,{"$f":"SUM(CheckList14[[#This Row],[JAN]:[DEC]])","v":36000},null,null,null,"Baltic",0,{"$f":"IF(T31=1,COUNTIF($T$3:T31,1),\"\")","v":""},{"$f":"IFERROR(INDEX($S$3:$S$281,MATCH(ROWS($U$3:U31),$U$3:$U$281,0)),\"\")","v":""},{"$f":"IFERROR(INDEX($S$3:$S$281,MATCH(ROWS($U$3:V31),$U$3:$U$281,0)),\"\")","v":""},{"$f":"IFERROR(INDEX($S$3:$S$281,MATCH(ROWS($U$3:U31),$U$3:$U$281,0)),\"\")","v":""},null,{"$f":"$V$3:INDEX($V$3:$V$281,MAX($U$3:$U$281),1)","v":"Saltspring Island"}]
[null,"End of Month (no Storage Limit) (imp gals)",{"$f":"C27+C28-C31","v":13666.141732283468},11553.543307086615,11144.094488188977,9833.8582677165359,9094.4881889763783,8109.4488188976393,4551.1811023622067,1197.6377952755929,-1951.1811023622022,1348.8188976377955,5727.5590551181103,9533.0708661417339,null,{"$f":"SUM(CheckList14[[#This Row],[JAN]:[DEC]])","v":83808.661417322844},null,null,"Banff",0,{"$f":"IF(T32=1,COUNTIF($T$3:T32,1),\"\")","v":""},{"$f":"IFERROR(INDEX($S$3:$S$281,MATCH(ROWS($U$3:U32),$U$3:$U$281,0)),\"\")","v":""},{"$f":"IFERROR(INDEX($S$3:$S$281,MATCH(ROWS($U$3:V32),$U$3:$U$281,0)),\"\")","v":""},{"$f":"IFERROR(INDEX($S$3:$S$281,MATCH(ROWS($U$3:U32),$U$3:$U$281,0)),\"\")","v":""},null,{"$f":"$V$3:INDEX($V$3:$V$281,MAX($U$3:$U$281),1)","v":"Saltspring Island"}]
[null,"Overflow Volume - wastage  (imp gals)",{"$f":"C32-C34","v":3666.1417322834677},{"$f":"D32-D34","v":1553.5433070866147},1144.0944881889773,0,0,0,0,0,0,0,0,0,{"$f":"SUM(CheckList14[[#This Row],[JAN]:[DEC]])","v":6363.7795275590597}]
[null,"End of Month in Storage (imp gals) (make-up)",{"$f":"IF(C32>$C$36,($C$36),(C32))","v":10000},10000,10000,9833.8582677165359,9094.4881889763783,8109.4488188976393,4551.1811023622067,1197.6377952755929,-1951.1811023622022,1348.8188976377955,5727.5590551181103,9533.0708661417339,null,{"$f":"SUM(CheckList14[[#This Row],[JAN]:[DEC]])","v":77444.881889763798},null,null,"Bangor",{"$f":"--ISNUMBER(IFERROR(SEARCH($K$2,S34,1),\"\"))","v":0},{"$f":"IF(T34=1,COUNTIF($T$3:T34,1),\"\")","v":""},{"$f":"IFERROR(INDEX($S$3:$S$281,MATCH(ROWS($U$3:U34),$U$3:$U$281,0)),\"\")","v":""},{"$f":"IFERROR(INDEX($S$3:$S$281,MATCH(ROWS($U$3:V34),$U$3:$U$281,0)),\"\")","v":""},{"$f":"IFERROR(INDEX($S$3:$S$281,MATCH(ROWS($U$3:U34),$U$3:$U$281,0)),\"\")","v":""},null,{"$f":"$V$3:INDEX($V$3:$V$281,MAX($U$3:$U$281),1)","v":"Saltspring Island"}]
[null,null,null,null,null,null,null,null,null,null,null,null,null,null,null,null,null,null,"Bathurst",{"$f":"--ISNUMBER(IFERROR(SEARCH($K$2,S35,1),\"\"))","v":0},{"$f":"IF(T35=1,COUNTIF($T$3:T35,1),\"\")","v":""},{"$f":"IFERROR(INDEX($S$3:$S$281,MATCH(ROWS($U$3:U35),$U$3:$U$281,0)),\"\")","v":""},{"$f":"IFERROR(INDEX($S$3:$S$281,MATCH(ROWS($U$3:V35),$U$3:$U$281,0)),\"\")","v":""},{"$f":"IFERROR(INDEX($S$3:$S$281,MATCH(ROWS($U$3:U35),$U$3:$U$281,0)),\"\")","v":""},null,{"$f":"$V$3:INDEX($V$3:$V$281,MAX($U$3:$U$281),1)","v":"Saltspring Island"}]
[null,"SELECTED TANK CAPACITY (IMP GALS)",10000,null,null,null,null,null,null,null,null,null,null,null,null,null,null,null,"Bella Coola",{"$f":"--ISNUMBER(IFERROR(SEARCH($K$2,S36,1),\"\"))","v":0},{"$f":"IF(T36=1,COUNTIF($T$3:T36,1),\"\")","v":""},{"$f":"IFERROR(INDEX($S$3:$S$281,MATCH(ROWS($U$3:U36),$U$3:$U$281,0)),\"\")","v":""},{"$f":"IFERROR(INDEX($S$3:$S$281,MATCH(ROWS($U$3:V36),$U$3:$U$281,0)),\"\")","v":""},{"$f":"IFERROR(INDEX($S$3:$S$281,MATCH(ROWS($U$3:U36),$U$3:$U$281,0)),\"\")","v":""},null,{"$f":"$V$3:INDEX($V$3:$V$281,MAX($U$3:$U$281),1)","v":"Saltspring Island"}]
[null,"ROOF AREA (SQFT)",2500,null,null,null,null,null,null,null,null,null,null,null,null,null,null,null,"Belleville",0,{"$f":"IF(T37=1,COUNTIF($T$3:T37,1),\"\")","v":""},{"$f":"IFERROR(INDEX($S$3:$S$281,MATCH(ROWS($U$3:U37),$U$3:$U$281,0)),\"\")","v":""},{"$f":"IFERROR(INDEX($S$3:$S$281,MATCH(ROWS($U$3:V37),$U$3:$U$281,0)),\"\")","v":""},{"$f":"IFERROR(INDEX($S$3:$S$281,MATCH(ROWS($U$3:U37),$U$3:$U$281,0)),\"\")","v":""},null,{"$f":"$V$3:INDEX($V$3:$V$281,MAX($U$3:$U$281),1)","v":"Saltspring Island"}]
[null,"ROOF EFFICIENCY",0.8,null,null,null,null,null,null,null,null,null,null,null,null,null,null,null,"Big Trout Lake",0,{"$f":"IF(T38=1,COUNTIF($T$3:T38,1),\"\")","v":""},{"$f":"IFERROR(INDEX($S$3:$S$281,MATCH(ROWS($U$3:U38),$U$3:$U$281,0)),\"\")","v":""},{"$f":"IFERROR(INDEX($S$3:$S$281,MATCH(ROWS($U$3:V38),$U$3:$U$281,0)),\"\")","v":""},{"$f":"IFERROR(INDEX($S$3:$S$281,MATCH(ROWS($U$3:U38),$U$3:$U$281,0)),\"\")","v":""},null,{"$f":"$V$3:INDEX($V$3:$V$281,MAX($U$3:$U$281),1)","v":"Saltspring Island"}]
[null,"SELECTED TANK CAPACITY (IMP GALS)",5000,null,null,null,null,null,null,null,null,null,null,null,null,null,null,null,"Bella Coola",0,{"$f":"IF(T39=1,COUNTIF($T$3:T39,1),\"\")","v":""},{"$f":"IFERROR(INDEX($S$3:$S$281,MATCH(ROWS($U$3:U39),$U$3:$U$281,0)),\"\")","v":""},{"$f":"IFERROR(INDEX($S$3:$S$281,MATCH(ROWS($U$3:V39),$U$3:$U$281,0)),\"\")","v":""},{"$f":"IFERROR(INDEX($S$3:$S$281,MATCH(ROWS($U$3:U39),$U$3:$U$281,0)),\"\")","v":""},null,{"$f":"$V$3:INDEX($V$3:$V$281,MAX($U$3:$U$281),1)","v":"Saltspring Island"}]
[null,"ROOF AREA (SQFT)",2500,null,null,null,null,null,null,null,null,null,null,null,null,null,null,null,"Belleville",0,{"$f":"IF(T40=1,COUNTIF($T$3:T40,1),\"\")","v":""},{"$f":"IFERROR(INDEX($S$3:$S$281,MATCH(ROWS($U$3:U40),$U$3:$U$281,0)),\"\")","v":""},{"$f":"IFERROR(INDEX($S$3:$S$281,MATCH(ROWS($U$3:V40),$U$3:$U$281,0)),\"\")","v":""},{"$f":"IFERROR(INDEX($S$3:$S$281,MATCH(ROWS($U$3:U40),$U$3:$U$281,0)),\"\")","v":""},null,{"$f":"$V$3:INDEX($V$3:$V$281,MAX($U$3:$U$281),1)","v":"Saltspring Island"}]
[null,"ROOF EFFICIENCY",0.9,null,null,null,null,null,null,null,null,null,null,null,null,null,null,null,"Big Trout Lake",0,{"$f":"IF(T41=1,COUNTIF($T$3:T45,1),\"\")","v":""},{"$f":"IFERROR(INDEX($S$3:$S$281,MATCH(ROWS($U$3:U45),$U$3:$U$281,0)),\"\")","v":""},{"$f":"IFERROR(INDEX($S$3:$S$281,MATCH(ROWS($U$3:V45),$U$3:$U$281,0)),\"\")","v":""},{"$f":"IFERROR(INDEX($S$3:$S$281,MATCH(ROWS($U$3:U45),$U$3:$U$281,0)),\"\")","v":""},null,{"$f":"$V$3:INDEX($V$3:$V$281,MAX($U$3:$U$281),1)","v":"Saltspring Island"}]
[]
[null,"ANNUAL OVERFLOW VOLUME (WASTAGE)",{"$f":"100%-((O27-(P32-P34))/O27)","v":0.15747018938508273},null,null,null,null,null,null,null,null,null,null,null,null,null,null,null,"Barkerville",0,{"$f":"IF(T43=1,COUNTIF($T$3:T43,1),\"\")","v":""},{"$f":"IFERROR(INDEX($S$3:$S$281,MATCH(ROWS($U$3:U43),$U$3:$U$281,0)),\"\")","v":""},{"$f":"IFERROR(INDEX($S$3:$S$281,MATCH(ROWS($U$3:V43),$U$3:$U$281,0)),\"\")","v":""},{"$f":"IFERROR(INDEX($S$3:$S$281,MATCH(ROWS($U$3:U43),$U$3:$U$281,0)),\"\")","v":""},null,{"$f":"$V$3:INDEX($V$3:$V$281,MAX($U$3:$U$281),1)","v":"Saltspring Island"}]
[null,"ANNUAL MAKE-UP WATER (SHORTFALL) ",{"$f":"(IF(C32<0,($C32),(0))+IF(D32<0,($D32),(0))+IF(E32<0,($E32),(0))+IF(F32<0,($F32),(0))+IF(G32<0,($G32),(0))+IF(H32<0,($H32),(0))+IF(I32<0,($I32),(0))+IF(J32<0,($J32),(0))+IF(K32<0,($K32),(0))+IF(L32<0,($L32),(0))+IF(M32<0,($M32),(0))+IF(N32<0,($N32),(0)))/O31","v":-5.4199475065616724E-2},null,null,null,null,null,null,null,null,null,null,null,null,null,null,null,"Barrie",0,{"$f":"IF(T44=1,COUNTIF($T$3:T44,1),\"\")","v":""},{"$f":"IFERROR(INDEX($S$3:$S$281,MATCH(ROWS($U$3:U44),$U$3:$U$281,0)),\"\")","v":""},{"$f":"IFERROR(INDEX($S$3:$S$281,MATCH(ROWS($U$3:V44),$U$3:$U$281,0)),\"\")","v":""},{"$f":"IFERROR(INDEX($S$3:$S$281,MATCH(ROWS($U$3:U44),$U$3:$U$281,0)),\"\")","v":""},null,{"$f":"$V$3:INDEX($V$3:$V$281,MAX($U$3:$U$281),1)","v":"Saltspring Island"}]
[null,null,null,null,null,null,null,null,null,null,null,null,null,null,null,null,null,null,"Bathurst",0,{"$f":"IF(T45=1,COUNTIF($T$3:T45,1),\"\")","v":""},{"$f":"IFERROR(INDEX($S$3:$S$281,MATCH(ROWS($U$3:U45),$U$3:$U$281,0)),\"\")","v":""},{"$f":"IFERROR(INDEX($S$3:$S$281,MATCH(ROWS($U$3:V45),$U$3:$U$281,0)),\"\")","v":""},{"$f":"IFERROR(INDEX($S$3:$S$281,MATCH(ROWS($U$3:U45),$U$3:$U$281,0)),\"\")","v":""},null,{"$f":"$V$3:INDEX($V$3:$V$281,MAX($U$3:$U$281),1)","v":"Saltspring Island"}]
[null,"Notes:",null,null,null,null,null,null,null,null,null,null,null,null,null,null,null,null,"Caplan",0,{"$f":"IF(T46=1,COUNTIF($T$3:T46,1),\"\")","v":""},{"$f":"IFERROR(INDEX($S$3:$S$281,MATCH(ROWS($U$3:U46),$U$3:$U$281,0)),\"\")","v":""},{"$f":"IFERROR(INDEX($S$3:$S$281,MATCH(ROWS($U$3:V46),$U$3:$U$281,0)),\"\")","v":""},{"$f":"IFERROR(INDEX($S$3:$S$281,MATCH(ROWS($U$3:U46),$U$3:$U$281,0)),\"\")","v":""},null,{"$f":"$V$3:INDEX($V$3:$V$281,MAX($U$3:$U$281),1)","v":"Saltspring Island"}]
[null,"- Performance based on monthly averages. ",null,null,null,null,null,null,null,null,null,null,null,null,null,null,null,null,"Cardston",0,{"$f":"IF(T47=1,COUNTIF($T$3:T47,1),\"\")","v":""},{"$f":"IFERROR(INDEX($S$3:$S$281,MATCH(ROWS($U$3:U47),$U$3:$U$281,0)),\"\")","v":""},{"$f":"IFERROR(INDEX($S$3:$S$281,MATCH(ROWS($U$3:V47),$U$3:$U$281,0)),\"\")","v":""},{"$f":"IFERROR(INDEX($S$3:$S$281,MATCH(ROWS($U$3:U47),$U$3:$U$281,0)),\"\")","v":""},null,{"$f":"$V$3:INDEX($V$3:$V$281,MAX($U$3:$U$281),1)","v":"Saltspring Island"}]
[null,"- Bracketed numbers indicate rainwater shortfall",null,null,null,null,null,null,null,null,null,null,null,null,null,null,null,null,"Cartwright",0,{"$f":"IF(T48=1,COUNTIF($T$3:T48,1),\"\")","v":""},{"$f":"IFERROR(INDEX($S$3:$S$281,MATCH(ROWS($U$3:U48),$U$3:$U$281,0)),\"\")","v":""},{"$f":"IFERROR(INDEX($S$3:$S$281,MATCH(ROWS($U$3:V48),$U$3:$U$281,0)),\"\")","v":""},{"$f":"IFERROR(INDEX($S$3:$S$281,MATCH(ROWS($U$3:U48),$U$3:$U$281,0)),\"\")","v":""},null,{"$f":"$V$3:INDEX($V$3:$V$281,MAX($U$3:$U$281),1)","v":"Saltspring Island"}]
[null,"- Precipitation includes snowfall",null,null,null,null,null,null,null,null,null,null,null,null,null,null,null,null,"Castlegar",0,{"$f":"IF(T49=1,COUNTIF($T$3:T49,1),\"\")","v":""},{"$f":"IFERROR(INDEX($S$3:$S$281,MATCH(ROWS($U$3:U49),$U$3:$U$281,0)),\"\")","v":""},{"$f":"IFERROR(INDEX($S$3:$S$281,MATCH(ROWS($U$3:V49),$U$3:$U$281,0)),\"\")","v":""},{"$f":"IFERROR(INDEX($S$3:$S$281,MATCH(ROWS($U$3:U49),$U$3:$U$281,0)),\"\")","v":""},null,{"$f":"$V$3:INDEX($V$3:$V$281,MAX($U$3:$U$281),1)","v":"Saltspring Island"}]
[null,"- Useful links:",null,null,null,null,null,null,null,null,null,null,null,null,null,null,null,null,"Channel-Port-Aux-Basques",0,{"$f":"IF(T50=1,COUNTIF($T$3:T50,1),\"\")","v":""},{"$f":"IFERROR(INDEX($S$3:$S$281,MATCH(ROWS($U$3:U50),$U$3:$U$281,0)),\"\")","v":""},{"$f":"IFERROR(INDEX($S$3:$S$281,MATCH(ROWS($U$3:V50),$U$3:$U$281,0)),\"\")","v":""},{"$f":"IFERROR(INDEX($S$3:$S$281,MATCH(ROWS($U$3:U50),$U$3:$U$281,0)),\"\")","v":""},null,{"$f":"$V$3:INDEX($V$3:$V$281,MAX($U$3:$U$281),1)","v":"Saltspring Island"}]
[null," *Rainwater Guide for Homeowners - CMHC",null,null,null,null,null,null,null,null,null,null,null,null,null,null,null,null,"Chapleau",0,{"$f":"IF(T51=1,COUNTIF($T$3:T51,1),\"\")","v":""},{"$f":"IFERROR(INDEX($S$3:$S$281,MATCH(ROWS($U$3:U51),$U$3:$U$281,0)),\"\")","v":""},{"$f":"IFERROR(INDEX($S$3:$S$281,MATCH(ROWS($U$3:V51),$U$3:$U$281,0)),\"\")","v":""},{"$f":"IFERROR(INDEX($S$3:$S$281,MATCH(ROWS($U$3:U51),$U$3:$U$281,0)),\"\")","v":""},null,{"$f":"$V$3:INDEX($V$3:$V$281,MAX($U$3:$U$281),1)","v":"Saltspring Island"}]
[null," *Irrigation Discussion",null,null,null,null,null,null,null,null,null,null,null,null,null,null,null,null,"Charlottetown",0,{"$f":"IF(T52=1,COUNTIF($T$3:T52,1),\"\")","v":""},{"$f":"IFERROR(INDEX($S$3:$S$281,MATCH(ROWS($U$3:U52),$U$3:$U$281,0)),\"\")","v":""},{"$f":"IFERROR(INDEX($S$3:$S$281,MATCH(ROWS($U$3:V52),$U$3:$U$281,0)),\"\")","v":""},{"$f":"IFERROR(INDEX($S$3:$S$281,MATCH(ROWS($U$3:U52),$U$3:$U$281,0)),\"\")","v":""},null,{"$f":"$V$3:INDEX($V$3:$V$281,MAX($U$3:$U$281),1)","v":"Saltspring Island"}]
[null," *Irrigation Calculator",null,null,null,null,null,null,null,null,null,null,null,null,null,null,null,null,"Chatham-Kent",0,{"$f":"IF(T53=1,COUNTIF($T$3:T53,1),\"\")","v":""},{"$f":"IFERROR(INDEX($S$3:$S$281,MATCH(ROWS($U$3:U53),$U$3:$U$281,0)),\"\")","v":""},{"$f":"IFERROR(INDEX($S$3:$S$281,MATCH(ROWS($U$3:V53),$U$3:$U$281,0)),\"\")","v":""},{"$f":"IFERROR(INDEX($S$3:$S$281,MATCH(ROWS($U$3:U53),$U$3:$U$281,0)),\"\")","v":""},null,{"$f":"$V$3:INDEX($V$3:$V$281,MAX($U$3:$U$281),1)","v":"Saltspring Island"}]
[null," *Premierplastics.com",null,null,null,null,null,null,null,null,null,null,null,null,null,null,null,null,"Cheticamp",0,{"$f":"IF(T54=1,COUNTIF($T$3:T54,1),\"\")","v":""},{"$f":"IFERROR(INDEX($S$3:$S$281,MATCH(ROWS($U$3:U54),$U$3:$U$281,0)),\"\")","v":""},{"$f":"IFERROR(INDEX($S$3:$S$281,MATCH(ROWS($U$3:V54),$U$3:$U$281,0)),\"\")","v":""},{"$f":"IFERROR(INDEX($S$3:$S$281,MATCH(ROWS($U$3:U54),$U$3:$U$281,0)),\"\")","v":""},null,{"$f":"$V$3:INDEX($V$3:$V$281,MAX($U$3:$U$281),1)","v":"Saltspring Island"}]
[null,null,null,null,null,null,null,null,null,null,null,null,null,null,null,null,null,null,"Chilliwack",0,{"$f":"IF(T55=1,COUNTIF($T$3:T55,1),\"\")","v":""},{"$f":"IFERROR(INDEX($S$3:$S$281,MATCH(ROWS($U$3:U55),$U$3:$U$281,0)),\"\")","v":""},{"$f":"IFERROR(INDEX($S$3:$S$281,MATCH(ROWS($U$3:V55),$U$3:$U$281,0)),\"\")","v":""},{"$f":"IFERROR(INDEX($S$3:$S$281,MATCH(ROWS($U$3:U55),$U$3:$U$281,0)),\"\")","v":""},null,{"$f":"$V$3:INDEX($V$3:$V$281,MAX($U$3:$U$281),1)","v":"Saltspring Island"}]
[null,null,null,null,null,null,null,null,null,null,null,null,null,null,null,null,null,null,"Churchill",0,{"$f":"IF(T56=1,COUNTIF($T$3:T56,1),\"\")","v":""},{"$f":"IFERROR(INDEX($S$3:$S$281,MATCH(ROWS($U$3:U56),$U$3:$U$281,0)),\"\")","v":""},{"$f":"IFERROR(INDEX($S$3:$S$281,MATCH(ROWS($U$3:V56),$U$3:$U$281,0)),\"\")","v":""},{"$f":"IFERROR(INDEX($S$3:$S$281,MATCH(ROWS($U$3:U56),$U$3:$U$281,0)),\"\")","v":""},null,{"$f":"$V$3:INDEX($V$3:$V$281,MAX($U$3:$U$281),1)","v":"Saltspring Island"}]
[null,null,null,null,null,null,null,null,null,null,null,null,null,null,null,null,null,null,"Churchill Falls",0,{"$f":"IF(T57=1,COUNTIF($T$3:T57,1),\"\")","v":""},{"$f":"IFERROR(INDEX($S$3:$S$281,MATCH(ROWS($U$3:U57),$U$3:$U$281,0)),\"\")","v":""},{"$f":"IFERROR(INDEX($S$3:$S$281,MATCH(ROWS($U$3:V57),$U$3:$U$281,0)),\"\")","v":""},{"$f":"IFERROR(INDEX($S$3:$S$281,MATCH(ROWS($U$3:U57),$U$3:$U$281,0)),\"\")","v":""},null,{"$f":"$V$3:INDEX($V$3:$V$281,MAX($U$3:$U$281),1)","v":"Saltspring Island"}]
[null,null,null,null,null,null,null,null,null,null,null,null,null,null,null,null,null,null,"Cold Lake",0,{"$f":"IF(T58=1,COUNTIF($T$3:T58,1),\"\")","v":""},{"$f":"IFERROR(INDEX($S$3:$S$281,MATCH(ROWS($U$3:U58),$U$3:$U$281,0)),\"\")","v":""},{"$f":"IFERROR(INDEX($S$3:$S$281,MATCH(ROWS($U$3:V58),$U$3:$U$281,0)),\"\")","v":""},{"$f":"IFERROR(INDEX($S$3:$S$281,MATCH(ROWS($U$3:U58),$U$3:$U$281,0)),\"\")","v":""},null,{"$f":"$V$3:INDEX($V$3:$V$281,MAX($U$3:$U$281),1)","v":"Saltspring Island"}]
[null,null,null,null,null,null,null,null,null,null,null,null,null,null,null,null,null,null,"Collins Bay",0,{"$f":"IF(T59=1,COUNTIF($T$3:T59,1),\"\")","v":""},{"$f":"IFERROR(INDEX($S$3:$S$281,MATCH(ROWS($U$3:U59),$U$3:$U$281,0)),\"\")","v":""},{"$f":"IFERROR(INDEX($S$3:$S$281,MATCH(ROWS($U$3:V59),$U$3:$U$281,0)),\"\")","v":""},{"$f":"IFERROR(INDEX($S$3:$S$281,MATCH(ROWS($U$3:U59),$U$3:$U$281,0)),\"\")","v":""},null,{"$f":"$V$3:INDEX($V$3:$V$281,MAX($U$3:$U$281),1)","v":"Saltspring Island"}]
[null,null,null,null,null,null,null,null,null,null,null,null,null,null,null,null,null,null,"Come By Chance",0,{"$f":"IF(T60=1,COUNTIF($T$3:T60,1),\"\")","v":""},{"$f":"IFERROR(INDEX($S$3:$S$281,MATCH(ROWS($U$3:U60),$U$3:$U$281,0)),\"\")","v":""},{"$f":"IFERROR(INDEX($S$3:$S$281,MATCH(ROWS($U$3:V60),$U$3:$U$281,0)),\"\")","v":""},{"$f":"IFERROR(INDEX($S$3:$S$281,MATCH(ROWS($U$3:U60),$U$3:$U$281,0)),\"\")","v":""},null,{"$f":"$V$3:INDEX($V$3:$V$281,MAX($U$3:$U$281),1)","v":"Saltspring Island"}]
[null,null,null,null,null,null,null,null,null,null,null,null,null,null,null,null,null,null,"Corner Brook",0,{"$f":"IF(T61=1,COUNTIF($T$3:T61,1),\"\")","v":""},{"$f":"IFERROR(INDEX($S$3:$S$281,MATCH(ROWS($U$3:U61),$U$3:$U$281,0)),\"\")","v":""},{"$f":"IFERROR(INDEX($S$3:$S$281,MATCH(ROWS($U$3:V61),$U$3:$U$281,0)),\"\")","v":""},{"$f":"IFERROR(INDEX($S$3:$S$281,MATCH(ROWS($U$3:U61),$U$3:$U$281,0)),\"\")","v":""},null,{"$f":"$V$3:INDEX($V$3:$V$281,MAX($U$3:$U$281),1)","v":"Saltspring Island"}]
[null,null,null,null,null,null,null,null,null,null,null,null,null,null,null,null,null,null,"Cornwall",0,{"$f":"IF(T62=1,COUNTIF($T$3:T62,1),\"\")","v":""},{"$f":"IFERROR(INDEX($S$3:$S$281,MATCH(ROWS($U$3:U62),$U$3:$U$281,0)),\"\")","v":""},{"$f":"IFERROR(INDEX($S$3:$S$281,MATCH(ROWS($U$3:V62),$U$3:$U$281,0)),\"\")","v":""},{"$f":"IFERROR(INDEX($S$3:$S$281,MATCH(ROWS($U$3:U62),$U$3:$U$281,0)),\"\")","v":""},null,{"$f":"$V$3:INDEX($V$3:$V$281,MAX($U$3:$U$281),1)","v":"Saltspring Island"}]
[null,null,null,null,null,null,null,null,null,null,null,null,null,null,null,null,null,null,"Cortes Island, Whaletown",0,{"$f":"IF(T63=1,COUNTIF($T$3:T63,1),\"\")","v":""},{"$f":"IFERROR(INDEX($S$3:$S$281,MATCH(ROWS($U$3:U63),$U$3:$U$281,0)),\"\")","v":""},{"$f":"IFERROR(INDEX($S$3:$S$281,MATCH(ROWS($U$3:V63),$U$3:$U$281,0)),\"\")","v":""},{"$f":"IFERROR(INDEX($S$3:$S$281,MATCH(ROWS($U$3:U63),$U$3:$U$281,0)),\"\")","v":""},null,{"$f":"$V$3:INDEX($V$3:$V$281,MAX($U$3:$U$281),1)","v":"Saltspring Island"}]
[null,null,null,null,null,null,null,null,null,null,null,null,null,null,null,null,null,null,"Courtenay - Comox",0,{"$f":"IF(T64=1,COUNTIF($T$3:T64,1),\"\")","v":""},{"$f":"IFERROR(INDEX($S$3:$S$281,MATCH(ROWS($U$3:U64),$U$3:$U$281,0)),\"\")","v":""},{"$f":"IFERROR(INDEX($S$3:$S$281,MATCH(ROWS($U$3:V64),$U$3:$U$281,0)),\"\")","v":""},{"$f":"IFERROR(INDEX($S$3:$S$281,MATCH(ROWS($U$3:U64),$U$3:$U$281,0)),\"\")","v":""},null,{"$f":"$V$3:INDEX($V$3:$V$281,MAX($U$3:$U$281),1)","v":"Saltspring Island"}]
[null,null,null,null,null,null,null,null,null,null,null,null,null,null,null,null,null,null,"Cranbrook",0,{"$f":"IF(T65=1,COUNTIF($T$3:T65,1),\"\")","v":""},{"$f":"IFERROR(INDEX($S$3:$S$281,MATCH(ROWS($U$3:U65),$U$3:$U$281,0)),\"\")","v":""},{"$f":"IFERROR(INDEX($S$3:$S$281,MATCH(ROWS($U$3:V65),$U$3:$U$281,0)),\"\")","v":""},{"$f":"IFERROR(INDEX($S$3:$S$281,MATCH(ROWS($U$3:U65),$U$3:$U$281,0)),\"\")","v":""},null,{"$f":"$V$3:INDEX($V$3:$V$281,MAX($U$3:$U$281),1)","v":"Saltspring Island"}]
[null,null,null,null,null,null,null,null,null,null,null,null,null,null,null,null,null,null,"Cree Lake",0,{"$f":"IF(T66=1,COUNTIF($T$3:T66,1),\"\")","v":""},{"$f":"IFERROR(INDEX($S$3:$S$281,MATCH(ROWS($U$3:U66),$U$3:$U$281,0)),\"\")","v":""},{"$f":"IFERROR(INDEX($S$3:$S$281,MATCH(ROWS($U$3:V66),$U$3:$U$281,0)),\"\")","v":""},{"$f":"IFERROR(INDEX($S$3:$S$281,MATCH(ROWS($U$3:U66),$U$3:$U$281,0)),\"\")","v":""},null,{"$f":"$V$3:INDEX($V$3:$V$281,MAX($U$3:$U$281),1)","v":"Saltspring Island"}]
[null,null,null,null,null,null,null,null,null,null,null,null,null,null,null,null,null,null,"Cross Lake",0,{"$f":"IF(T67=1,COUNTIF($T$3:T67,1),\"\")","v":""},{"$f":"IFERROR(INDEX($S$3:$S$281,MATCH(ROWS($U$3:U67),$U$3:$U$281,0)),\"\")","v":""},{"$f":"IFERROR(INDEX($S$3:$S$281,MATCH(ROWS($U$3:V67),$U$3:$U$281,0)),\"\")","v":""},{"$f":"IFERROR(INDEX($S$3:$S$281,MATCH(ROWS($U$3:U67),$U$3:$U$281,0)),\"\")","v":""},null,{"$f":"$V$3:INDEX($V$3:$V$281,MAX($U$3:$U$281),1)","v":"Saltspring Island"}]
[null,null,null,null,null,null,null,null,null,null,null,null,null,null,null,null,null,null,"Cypress Hills",0,{"$f":"IF(T68=1,COUNTIF($T$3:T68,1),\"\")","v":""},{"$f":"IFERROR(INDEX($S$3:$S$281,MATCH(ROWS($U$3:U68),$U$3:$U$281,0)),\"\")","v":""},{"$f":"IFERROR(INDEX($S$3:$S$281,MATCH(ROWS($U$3:V68),$U$3:$U$281,0)),\"\")","v":""},{"$f":"IFERROR(INDEX($S$3:$S$281,MATCH(ROWS($U$3:U68),$U$3:$U$281,0)),\"\")","v":""},null,{"$f":"$V$3:INDEX($V$3:$V$281,MAX($U$3:$U$281),1)","v":"Saltspring Island"}]
[null,null,null,null,null,null,null,null,null,null,null,null,null,null,null,null,null,null,"Dalhousie",0,{"$f":"IF(T69=1,COUNTIF($T$3:T69,1),\"\")","v":""},{"$f":"IFERROR(INDEX($S$3:$S$281,MATCH(ROWS($U$3:U69),$U$3:$U$281,0)),\"\")","v":""},{"$f":"IFERROR(INDEX($S$3:$S$281,MATCH(ROWS($U$3:V69),$U$3:$U$281,0)),\"\")","v":""},{"$f":"IFERROR(INDEX($S$3:$S$281,MATCH(ROWS($U$3:U69),$U$3:$U$281,0)),\"\")","v":""},null,{"$f":"$V$3:INDEX($V$3:$V$281,MAX($U$3:$U$281),1)","v":"Saltspring Island"}]
[null,null,null,null,null,null,null,null,null,null,null,null,null,null,null,null,null,null,"Dauphin",0,{"$f":"IF(T70=1,COUNTIF($T$3:T70,1),\"\")","v":""},{"$f":"IFERROR(INDEX($S$3:$S$281,MATCH(ROWS($U$3:U70),$U$3:$U$281,0)),\"\")","v":""},{"$f":"IFERROR(INDEX($S$3:$S$281,MATCH(ROWS($U$3:V70),$U$3:$U$281,0)),\"\")","v":""},{"$f":"IFERROR(INDEX($S$3:$S$281,MATCH(ROWS($U$3:U70),$U$3:$U$281,0)),\"\")","v":""},null,{"$f":"$V$3:INDEX($V$3:$V$281,MAX($U$3:$U$281),1)","v":"Saltspring Island"}]
[null,null,null,null,null,null,null,null,null,null,null,null,null,null,null,null,null,null,"Deer Lake",0,{"$f":"IF(T71=1,COUNTIF($T$3:T71,1),\"\")","v":""},{"$f":"IFERROR(INDEX($S$3:$S$281,MATCH(ROWS($U$3:U71),$U$3:$U$281,0)),\"\")","v":""},{"$f":"IFERROR(INDEX($S$3:$S$281,MATCH(ROWS($U$3:V71),$U$3:$U$281,0)),\"\")","v":""},{"$f":"IFERROR(INDEX($S$3:$S$281,MATCH(ROWS($U$3:U71),$U$3:$U$281,0)),\"\")","v":""},null,{"$f":"$V$3:INDEX($V$3:$V$281,MAX($U$3:$U$281),1)","v":"Saltspring Island"}]
[null,null,null,null,null,null,null,null,null,null,null,null,null,null,null,null,null,null,"Doaktown",0,{"$f":"IF(T72=1,COUNTIF($T$3:T72,1),\"\")","v":""},{"$f":"IFERROR(INDEX($S$3:$S$281,MATCH(ROWS($U$3:U72),$U$3:$U$281,0)),\"\")","v":""},{"$f":"IFERROR(INDEX($S$3:$S$281,MATCH(ROWS($U$3:V72),$U$3:$U$281,0)),\"\")","v":""},{"$f":"IFERROR(INDEX($S$3:$S$281,MATCH(ROWS($U$3:U72),$U$3:$U$281,0)),\"\")","v":""},null,{"$f":"$V$3:INDEX($V$3:$V$281,MAX($U$3:$U$281),1)","v":"Saltspring Island"}]
[null,null,null,null,null,null,null,null,null,null,null,null,null,null,null,null,null,null,"Drummondville",0,{"$f":"IF(T73=1,COUNTIF($T$3:T73,1),\"\")","v":""},{"$f":"IFERROR(INDEX($S$3:$S$281,MATCH(ROWS($U$3:U73),$U$3:$U$281,0)),\"\")","v":""},{"$f":"IFERROR(INDEX($S$3:$S$281,MATCH(ROWS($U$3:V73),$U$3:$U$281,0)),\"\")","v":""},{"$f":"IFERROR(INDEX($S$3:$S$281,MATCH(ROWS($U$3:U73),$U$3:$U$281,0)),\"\")","v":""},null,{"$f":"$V$3:INDEX($V$3:$V$281,MAX($U$3:$U$281),1)","v":"Saltspring Island"}]
[null,null,null,null,null,null,null,null,null,null,null,null,null,null,null,null,null,null,"Dryden",0,{"$f":"IF(T74=1,COUNTIF($T$3:T74,1),\"\")","v":""},{"$f":"IFERROR(INDEX($S$3:$S$281,MATCH(ROWS($U$3:U74),$U$3:$U$281,0)),\"\")","v":""},{"$f":"IFERROR(INDEX($S$3:$S$281,MATCH(ROWS($U$3:V74),$U$3:$U$281,0)),\"\")","v":""},{"$f":"IFERROR(INDEX($S$3:$S$281,MATCH(ROWS($U$3:U74),$U$3:$U$281,0)),\"\")","v":""},null,{"$f":"$V$3:INDEX($V$3:$V$281,MAX($U$3:$U$281),1)","v":"Saltspring Island"}]
[null,null,null,null,null,null,null,null,null,null,null,null,null,null,null,null,null,null,"Duncan",0,{"$f":"IF(T75=1,COUNTIF($T$3:T75,1),\"\")","v":""},{"$f":"IFERROR(INDEX($S$3:$S$281,MATCH(ROWS($U$3:U75),$U$3:$U$281,0)),\"\")","v":""},{"$f":"IFERROR(INDEX($S$3:$S$281,MATCH(ROWS($U$3:V75),$U$3:$U$281,0)),\"\")","v":""},{"$f":"IFERROR(INDEX($S$3:$S$281,MATCH(ROWS($U$3:U75),$U$3:$U$281,0)),\"\")","v":""},null,{"$f":"$V$3:INDEX($V$3:$V$281,MAX($U$3:$U$281),1)","v":"Saltspring Island"}]
[null,null,null,null,null,null,null,null,null,null,null,null,null,null,null,null,null,null,"Edmonton",0,{"$f":"IF(T76=1,COUNTIF($T$3:T76,1),\"\")","v":""},{"$f":"IFERROR(INDEX($S$3:$S$281,MATCH(ROWS($U$3:U76),$U$3:$U$281,0)),\"\")","v":""},{"$f":"IFERROR(INDEX($S$3:$S$281,MATCH(ROWS($U$3:V76),$U$3:$U$281,0)),\"\")","v":""},{"$f":"IFERROR(INDEX($S$3:$S$281,MATCH(ROWS($U$3:U76),$U$3:$U$281,0)),\"\")","v":""},null,{"$f":"$V$3:INDEX($V$3:$V$281,MAX($U$3:$U$281),1)","v":"Saltspring Island"}]
[null,null,null,null,null,null,null,null,null,null,null,null,null,null,null,null,null,null,"Edson",0,{"$f":"IF(T77=1,COUNTIF($T$3:T77,1),\"\")","v":""},{"$f":"IFERROR(INDEX($S$3:$S$281,MATCH(ROWS($U$3:U77),$U$3:$U$281,0)),\"\")","v":""},{"$f":"IFERROR(INDEX($S$3:$S$281,MATCH(ROWS($U$3:V77),$U$3:$U$281,0)),\"\")","v":""},{"$f":"IFERROR(INDEX($S$3:$S$281,MATCH(ROWS($U$3:U77),$U$3:$U$281,0)),\"\")","v":""},null,{"$f":"$V$3:INDEX($V$3:$V$281,MAX($U$3:$U$281),1)","v":"Saltspring Island"}]
[null,null,null,null,null,null,null,null,null,null,null,null,null,null,null,null,null,null,"Emerson",0,{"$f":"IF(T78=1,COUNTIF($T$3:T78,1),\"\")","v":""},{"$f":"IFERROR(INDEX($S$3:$S$281,MATCH(ROWS($U$3:U78),$U$3:$U$281,0)),\"\")","v":""},{"$f":"IFERROR(INDEX($S$3:$S$281,MATCH(ROWS($U$3:V78),$U$3:$U$281,0)),\"\")","v":""},{"$f":"IFERROR(INDEX($S$3:$S$281,MATCH(ROWS($U$3:U78),$U$3:$U$281,0)),\"\")","v":""},null,{"$f":"$V$3:INDEX($V$3:$V$281,MAX($U$3:$U$281),1)","v":"Saltspring Island"}]
[null,null,null,null,null,null,null,null,null,null,null,null,null,null,null,null,null,null,"Estevan",{"$f":"--ISNUMBER(IFERROR(SEARCH($K$2,S79,1),\"\"))","v":0},{"$f":"IF(T79=1,COUNTIF($T$3:T79,1),\"\")","v":""},{"$f":"IFERROR(INDEX($S$3:$S$281,MATCH(ROWS($U$3:U79),$U$3:$U$281,0)),\"\")","v":""},{"$f":"IFERROR(INDEX($S$3:$S$281,MATCH(ROWS($U$3:V79),$U$3:$U$281,0)),\"\")","v":""},{"$f":"IFERROR(INDEX($S$3:$S$281,MATCH(ROWS($U$3:U79),$U$3:$U$281,0)),\"\")","v":""},null,{"$f":"$V$3:INDEX($V$3:$V$281,MAX($U$3:$U$281),1)","v":"Saltspring Island"}]
[null,null,null,null,null,null,null,null,null,null,null,null,null,null,null,null,null,null,"Fermont",0,{"$f":"IF(T80=1,COUNTIF($T$3:T80,1),\"\")","v":""},{"$f":"IFERROR(INDEX($S$3:$S$281,MATCH(ROWS($U$3:U80),$U$3:$U$281,0)),\"\")","v":""},{"$f":"IFERROR(INDEX($S$3:$S$281,MATCH(ROWS($U$3:V80),$U$3:$U$281,0)),\"\")","v":""},{"$f":"IFERROR(INDEX($S$3:$S$281,MATCH(ROWS($U$3:U80),$U$3:$U$281,0)),\"\")","v":""},null,{"$f":"$V$3:INDEX($V$3:$V$281,MAX($U$3:$U$281),1)","v":"Saltspring Island"}]
[null,null,null,null,null,null,null,null,null,null,null,null,null,null,null,null,null,null,"Flin Flon",0,{"$f":"IF(T81=1,COUNTIF($T$3:T81,1),\"\")","v":""},{"$f":"IFERROR(INDEX($S$3:$S$281,MATCH(ROWS($U$3:U81),$U$3:$U$281,0)),\"\")","v":""},{"$f":"IFERROR(INDEX($S$3:$S$281,MATCH(ROWS($U$3:V81),$U$3:$U$281,0)),\"\")","v":""},{"$f":"IFERROR(INDEX($S$3:$S$281,MATCH(ROWS($U$3:U81),$U$3:$U$281,0)),\"\")","v":""},null,{"$f":"$V$3:INDEX($V$3:$V$281,MAX($U$3:$U$281),1)","v":"Saltspring Island"}]
[null,null,null,null,null,null,null,null,null,null,null,null,null,null,null,null,null,null,"Fort Chipewyan",0,{"$f":"IF(T82=1,COUNTIF($T$3:T82,1),\"\")","v":""},{"$f":"IFERROR(INDEX($S$3:$S$281,MATCH(ROWS($U$3:U82),$U$3:$U$281,0)),\"\")","v":""},{"$f":"IFERROR(INDEX($S$3:$S$281,MATCH(ROWS($U$3:V82),$U$3:$U$281,0)),\"\")","v":""},{"$f":"IFERROR(INDEX($S$3:$S$281,MATCH(ROWS($U$3:U82),$U$3:$U$281,0)),\"\")","v":""},null,{"$f":"$V$3:INDEX($V$3:$V$281,MAX($U$3:$U$281),1)","v":"Saltspring Island"}]
[null,null,null,null,null,null,null,null,null,null,null,null,null,null,null,null,null,null,"Fort Frances",0,{"$f":"IF(T83=1,COUNTIF($T$3:T83,1),\"\")","v":""},{"$f":"IFERROR(INDEX($S$3:$S$281,MATCH(ROWS($U$3:U83),$U$3:$U$281,0)),\"\")","v":""},{"$f":"IFERROR(INDEX($S$3:$S$281,MATCH(ROWS($U$3:V83),$U$3:$U$281,0)),\"\")","v":""},{"$f":"IFERROR(INDEX($S$3:$S$281,MATCH(ROWS($U$3:U83),$U$3:$U$281,0)),\"\")","v":""},null,{"$f":"$V$3:INDEX($V$3:$V$281,MAX($U$3:$U$281),1)","v":"Saltspring Island"}]
[null,null,null,null,null,null,null,null,null,null,null,null,null,null,null,null,null,null,"Fort McMurray",0,{"$f":"IF(T84=1,COUNTIF($T$3:T84,1),\"\")","v":""},{"$f":"IFERROR(INDEX($S$3:$S$281,MATCH(ROWS($U$3:U84),$U$3:$U$281,0)),\"\")","v":""},{"$f":"IFERROR(INDEX($S$3:$S$281,MATCH(ROWS($U$3:V84),$U$3:$U$281,0)),\"\")","v":""},{"$f":"IFERROR(INDEX($S$3:$S$281,MATCH(ROWS($U$3:U84),$U$3:$U$281,0)),\"\")","v":""},null,{"$f":"$V$3:INDEX($V$3:$V$281,MAX($U$3:$U$281),1)","v":"Saltspring Island"}]
[null,null,null,null,null,null,null,null,null,null,null,null,null,null,null,null,null,null,"Fort Nelson",0,{"$f":"IF(T85=1,COUNTIF($T$3:T85,1),\"\")","v":""},{"$f":"IFERROR(INDEX($S$3:$S$281,MATCH(ROWS($U$3:U85),$U$3:$U$281,0)),\"\")","v":""},{"$f":"IFERROR(INDEX($S$3:$S$281,MATCH(ROWS($U$3:V85),$U$3:$U$281,0)),\"\")","v":""},{"$f":"IFERROR(INDEX($S$3:$S$281,MATCH(ROWS($U$3:U85),$U$3:$U$281,0)),\"\")","v":""},null,{"$f":"$V$3:INDEX($V$3:$V$281,MAX($U$3:$U$281),1)","v":"Saltspring Island"}]
[null,null,null,null,null,null,null,null,null,null,null,null,null,null,null,null,null,null,"Fort St John",0,{"$f":"IF(T86=1,COUNTIF($T$3:T86,1),\"\")","v":""},{"$f":"IFERROR(INDEX($S$3:$S$281,MATCH(ROWS($U$3:U86),$U$3:$U$281,0)),\"\")","v":""},{"$f":"IFERROR(INDEX($S$3:$S$281,MATCH(ROWS($U$3:V86),$U$3:$U$281,0)),\"\")","v":""},{"$f":"IFERROR(INDEX($S$3:$S$281,MATCH(ROWS($U$3:U86),$U$3:$U$281,0)),\"\")","v":""},null,{"$f":"$V$3:INDEX($V$3:$V$281,MAX($U$3:$U$281),1)","v":"Saltspring Island"}]
[null,null,null,null,null,null,null,null,null,null,null,null,null,null,null,null,null,null,"Fredericton",0,{"$f":"IF(T87=1,COUNTIF($T$3:T87,1),\"\")","v":""},{"$f":"IFERROR(INDEX($S$3:$S$281,MATCH(ROWS($U$3:U87),$U$3:$U$281,0)),\"\")","v":""},{"$f":"IFERROR(INDEX($S$3:$S$281,MATCH(ROWS($U$3:V87),$U$3:$U$281,0)),\"\")","v":""},{"$f":"IFERROR(INDEX($S$3:$S$281,MATCH(ROWS($U$3:U87),$U$3:$U$281,0)),\"\")","v":""},null,{"$f":"$V$3:INDEX($V$3:$V$281,MAX($U$3:$U$281),1)","v":"Saltspring Island"}]
[null,null,null,null,null,null,null,null,null,null,null,null,null,null,null,null,null,null,"French River, Chaudiere Dam",0,{"$f":"IF(T88=1,COUNTIF($T$3:T88,1),\"\")","v":""},{"$f":"IFERROR(INDEX($S$3:$S$281,MATCH(ROWS($U$3:U88),$U$3:$U$281,0)),\"\")","v":""},{"$f":"IFERROR(INDEX($S$3:$S$281,MATCH(ROWS($U$3:V88),$U$3:$U$281,0)),\"\")","v":""},{"$f":"IFERROR(INDEX($S$3:$S$281,MATCH(ROWS($U$3:U88),$U$3:$U$281,0)),\"\")","v":""},null,{"$f":"$V$3:INDEX($V$3:$V$281,MAX($U$3:$U$281),1)","v":"Saltspring Island"}]
[null,null,null,null,null,null,null,null,null,null,null,null,null,null,null,null,null,null,"Fundy National Park",0,{"$f":"IF(T89=1,COUNTIF($T$3:T89,1),\"\")","v":""},{"$f":"IFERROR(INDEX($S$3:$S$281,MATCH(ROWS($U$3:U89),$U$3:$U$281,0)),\"\")","v":""},{"$f":"IFERROR(INDEX($S$3:$S$281,MATCH(ROWS($U$3:V89),$U$3:$U$281,0)),\"\")","v":""},{"$f":"IFERROR(INDEX($S$3:$S$281,MATCH(ROWS($U$3:U89),$U$3:$U$281,0)),\"\")","v":""},null,{"$f":"$V$3:INDEX($V$3:$V$281,MAX($U$3:$U$281),1)","v":"Saltspring Island"}]
[null,null,null,null,null,null,null,null,null,null,null,null,null,null,null,null,null,null,"Gabriola Island",0,{"$f":"IF(T90=1,COUNTIF($T$3:T90,1),\"\")","v":""},{"$f":"IFERROR(INDEX($S$3:$S$281,MATCH(ROWS($U$3:U90),$U$3:$U$281,0)),\"\")","v":""},{"$f":"IFERROR(INDEX($S$3:$S$281,MATCH(ROWS($U$3:V90),$U$3:$U$281,0)),\"\")","v":""},{"$f":"IFERROR(INDEX($S$3:$S$281,MATCH(ROWS($U$3:U90),$U$3:$U$281,0)),\"\")","v":""},null,{"$f":"$V$3:INDEX($V$3:$V$281,MAX($U$3:$U$281),1)","v":"Saltspring Island"}]
[null,null,null,null,null,null,null,null,null,null,null,null,null,null,null,null,null,null,"Gander",0,{"$f":"IF(T91=1,COUNTIF($T$3:T91,1),\"\")","v":""},{"$f":"IFERROR(INDEX($S$3:$S$281,MATCH(ROWS($U$3:U91),$U$3:$U$281,0)),\"\")","v":""},{"$f":"IFERROR(INDEX($S$3:$S$281,MATCH(ROWS($U$3:V91),$U$3:$U$281,0)),\"\")","v":""},{"$f":"IFERROR(INDEX($S$3:$S$281,MATCH(ROWS($U$3:U91),$U$3:$U$281,0)),\"\")","v":""},null,{"$f":"$V$3:INDEX($V$3:$V$281,MAX($U$3:$U$281),1)","v":"Saltspring Island"}]
[null,null,null,null,null,null,null,null,null,null,null,null,null,null,null,null,null,null,"Gaspé",0,{"$f":"IF(T92=1,COUNTIF($T$3:T92,1),\"\")","v":""},{"$f":"IFERROR(INDEX($S$3:$S$281,MATCH(ROWS($U$3:U92),$U$3:$U$281,0)),\"\")","v":""},{"$f":"IFERROR(INDEX($S$3:$S$281,MATCH(ROWS($U$3:V92),$U$3:$U$281,0)),\"\")","v":""},{"$f":"IFERROR(INDEX($S$3:$S$281,MATCH(ROWS($U$3:U92),$U$3:$U$281,0)),\"\")","v":""},null,{"$f":"$V$3:INDEX($V$3:$V$281,MAX($U$3:$U$281),1)","v":"Saltspring Island"}]
[null,null,null,null,null,null,null,null,null,null,null,null,null,null,null,null,null,null,"Gibsons",0,{"$f":"IF(T93=1,COUNTIF($T$3:T93,1),\"\")","v":""},{"$f":"IFERROR(INDEX($S$3:$S$281,MATCH(ROWS($U$3:U93),$U$3:$U$281,0)),\"\")","v":""},{"$f":"IFERROR(INDEX($S$3:$S$281,MATCH(ROWS($U$3:V93),$U$3:$U$281,0)),\"\")","v":""},{"$f":"IFERROR(INDEX($S$3:$S$281,MATCH(ROWS($U$3:U93),$U$3:$U$281,0)),\"\")","v":""},null,{"$f":"$V$3:INDEX($V$3:$V$281,MAX($U$3:$U$281),1)","v":"Saltspring Island"}]
[null,null,null,null,null,null,null,null,null,null,null,null,null,null,null,null,null,null,"Gillam",0,{"$f":"IF(T94=1,COUNTIF($T$3:T94,1),\"\")","v":""},{"$f":"IFERROR(INDEX($S$3:$S$281,MATCH(ROWS($U$3:U94),$U$3:$U$281,0)),\"\")","v":""},{"$f":"IFERROR(INDEX($S$3:$S$281,MATCH(ROWS($U$3:V94),$U$3:$U$281,0)),\"\")","v":""},{"$f":"IFERROR(INDEX($S$3:$S$281,MATCH(ROWS($U$3:U94),$U$3:$U$281,0)),\"\")","v":""},null,{"$f":"$V$3:INDEX($V$3:$V$281,MAX($U$3:$U$281),1)","v":"Saltspring Island"}]
[null,null,null,null,null,null,null,null,null,null,null,null,null,null,null,null,null,null,"Gimli",0,{"$f":"IF(T95=1,COUNTIF($T$3:T95,1),\"\")","v":""},{"$f":"IFERROR(INDEX($S$3:$S$281,MATCH(ROWS($U$3:U95),$U$3:$U$281,0)),\"\")","v":""},{"$f":"IFERROR(INDEX($S$3:$S$281,MATCH(ROWS($U$3:V95),$U$3:$U$281,0)),\"\")","v":""},{"$f":"IFERROR(INDEX($S$3:$S$281,MATCH(ROWS($U$3:U95),$U$3:$U$281,0)),\"\")","v":""},null,{"$f":"$V$3:INDEX($V$3:$V$281,MAX($U$3:$U$281),1)","v":"Saltspring Island"}]
[null,null,null,null,null,null,null,null,null,null,null,null,null,null,null,null,null,null,"Gold River",0,{"$f":"IF(T96=1,COUNTIF($T$3:T96,1),\"\")","v":""},{"$f":"IFERROR(INDEX($S$3:$S$281,MATCH(ROWS($U$3:U96),$U$3:$U$281,0)),\"\")","v":""},{"$f":"IFERROR(INDEX($S$3:$S$281,MATCH(ROWS($U$3:V96),$U$3:$U$281,0)),\"\")","v":""},{"$f":"IFERROR(INDEX($S$3:$S$281,MATCH(ROWS($U$3:U96),$U$3:$U$281,0)),\"\")","v":""},null,{"$f":"$V$3:INDEX($V$3:$V$281,MAX($U$3:$U$281),1)","v":"Saltspring Island"}]
[null,null,null,null,null,null,null,null,null,null,null,null,null,null,null,null,null,null,"Golden",0,{"$f":"IF(T97=1,COUNTIF($T$3:T97,1),\"\")","v":""},{"$f":"IFERROR(INDEX($S$3:$S$281,MATCH(ROWS($U$3:U97),$U$3:$U$281,0)),\"\")","v":""},{"$f":"IFERROR(INDEX($S$3:$S$281,MATCH(ROWS($U$3:V97),$U$3:$U$281,0)),\"\")","v":""},{"$f":"IFERROR(INDEX($S$3:$S$281,MATCH(ROWS($U$3:U97),$U$3:$U$281,0)),\"\")","v":""},null,{"$f":"$V$3:INDEX($V$3:$V$281,MAX($U$3:$U$281),1)","v":"Saltspring Island"}]
[null,null,null,null,null,null,null,null,null,null,null,null,null,null,null,null,null,null,"Good Spirit Lake",0,{"$f":"IF(T98=1,COUNTIF($T$3:T98,1),\"\")","v":""},{"$f":"IFERROR(INDEX($S$3:$S$281,MATCH(ROWS($U$3:U98),$U$3:$U$281,0)),\"\")","v":""},{"$f":"IFERROR(INDEX($S$3:$S$281,MATCH(ROWS($U$3:V98),$U$3:$U$281,0)),\"\")","v":""},{"$f":"IFERROR(INDEX($S$3:$S$281,MATCH(ROWS($U$3:U98),$U$3:$U$281,0)),\"\")","v":""},null,{"$f":"$V$3:INDEX($V$3:$V$281,MAX($U$3:$U$281),1)","v":"Saltspring Island"}]
[null,null,null,null,null,null,null,null,null,null,null,null,null,null,null,null,null,null,"Gore Bay",0,{"$f":"IF(T99=1,COUNTIF($T$3:T99,1),\"\")","v":""},{"$f":"IFERROR(INDEX($S$3:$S$281,MATCH(ROWS($U$3:U99),$U$3:$U$281,0)),\"\")","v":""},{"$f":"IFERROR(INDEX($S$3:$S$281,MATCH(ROWS($U$3:V99),$U$3:$U$281,0)),\"\")","v":""},{"$f":"IFERROR(INDEX($S$3:$S$281,MATCH(ROWS($U$3:U99),$U$3:$U$281,0)),\"\")","v":""},null,{"$f":"$V$3:INDEX($V$3:$V$281,MAX($U$3:$U$281),1)","v":"Saltspring Island"}]
[null,null,null,null,null,null,null,null,null,null,null,null,null,null,null,null,null,null,"Granby",0,{"$f":"IF(T100=1,COUNTIF($T$3:T100,1),\"\")","v":""},{"$f":"IFERROR(INDEX($S$3:$S$281,MATCH(ROWS($U$3:U100),$U$3:$U$281,0)),\"\")","v":""},{"$f":"IFERROR(INDEX($S$3:$S$281,MATCH(ROWS($U$3:V100),$U$3:$U$281,0)),\"\")","v":""},{"$f":"IFERROR(INDEX($S$3:$S$281,MATCH(ROWS($U$3:U100),$U$3:$U$281,0)),\"\")","v":""},null,{"$f":"$V$3:INDEX($V$3:$V$281,MAX($U$3:$U$281),1)","v":"Saltspring Island"}]
[null,null,null,null,null,null,null,null,null,null,null,null,null,null,null,null,null,null,"Grand Falls",0,{"$f":"IF(T101=1,COUNTIF($T$3:T101,1),\"\")","v":""},{"$f":"IFERROR(INDEX($S$3:$S$281,MATCH(ROWS($U$3:U101),$U$3:$U$281,0)),\"\")","v":""},{"$f":"IFERROR(INDEX($S$3:$S$281,MATCH(ROWS($U$3:V101),$U$3:$U$281,0)),\"\")","v":""},{"$f":"IFERROR(INDEX($S$3:$S$281,MATCH(ROWS($U$3:U101),$U$3:$U$281,0)),\"\")","v":""},null,{"$f":"$V$3:INDEX($V$3:$V$281,MAX($U$3:$U$281),1)","v":"Saltspring Island"}]
[null,null,null,null,null,null,null,null,null,null,null,null,null,null,null,null,null,null,"Grand Rapids",0,{"$f":"IF(T102=1,COUNTIF($T$3:T102,1),\"\")","v":""},{"$f":"IFERROR(INDEX($S$3:$S$281,MATCH(ROWS($U$3:U102),$U$3:$U$281,0)),\"\")","v":""},{"$f":"IFERROR(INDEX($S$3:$S$281,MATCH(ROWS($U$3:V102),$U$3:$U$281,0)),\"\")","v":""},{"$f":"IFERROR(INDEX($S$3:$S$281,MATCH(ROWS($U$3:U102),$U$3:$U$281,0)),\"\")","v":""},null,{"$f":"$V$3:INDEX($V$3:$V$281,MAX($U$3:$U$281),1)","v":"Saltspring Island"}]
[null,null,null,null,null,null,null,null,null,null,null,null,null,null,null,null,null,null,"Grande Prairie",0,{"$f":"IF(T103=1,COUNTIF($T$3:T103,1),\"\")","v":""},{"$f":"IFERROR(INDEX($S$3:$S$281,MATCH(ROWS($U$3:U103),$U$3:$U$281,0)),\"\")","v":""},{"$f":"IFERROR(INDEX($S$3:$S$281,MATCH(ROWS($U$3:V103),$U$3:$U$281,0)),\"\")","v":""},{"$f":"IFERROR(INDEX($S$3:$S$281,MATCH(ROWS($U$3:U103),$U$3:$U$281,0)),\"\")","v":""},null,{"$f":"$V$3:INDEX($V$3:$V$281,MAX($U$3:$U$281),1)","v":"Saltspring Island"}]
[null,null,null,null,null,null,null,null,null,null,null,null,null,null,null,null,null,null,"Gros Morne National Park",0,{"$f":"IF(T104=1,COUNTIF($T$3:T104,1),\"\")","v":""},{"$f":"IFERROR(INDEX($S$3:$S$281,MATCH(ROWS($U$3:U104),$U$3:$U$281,0)),\"\")","v":""},{"$f":"IFERROR(INDEX($S$3:$S$281,MATCH(ROWS($U$3:V104),$U$3:$U$281,0)),\"\")","v":""},{"$f":"IFERROR(INDEX($S$3:$S$281,MATCH(ROWS($U$3:U104),$U$3:$U$281,0)),\"\")","v":""},null,{"$f":"$V$3:INDEX($V$3:$V$281,MAX($U$3:$U$281),1)","v":"Saltspring Island"}]
[null,null,null,null,null,null,null,null,null,null,null,null,null,null,null,null,null,null,"Guelph",0,{"$f":"IF(T105=1,COUNTIF($T$3:T105,1),\"\")","v":""},{"$f":"IFERROR(INDEX($S$3:$S$281,MATCH(ROWS($U$3:U105),$U$3:$U$281,0)),\"\")","v":""},{"$f":"IFERROR(INDEX($S$3:$S$281,MATCH(ROWS($U$3:V105),$U$3:$U$281,0)),\"\")","v":""},{"$f":"IFERROR(INDEX($S$3:$S$281,MATCH(ROWS($U$3:U105),$U$3:$U$281,0)),\"\")","v":""},null,{"$f":"$V$3:INDEX($V$3:$V$281,MAX($U$3:$U$281),1)","v":"Saltspring Island"}]
[null,null,null,null,null,null,null,null,null,null,null,null,null,null,null,null,null,null,"Halifax",0,{"$f":"IF(T106=1,COUNTIF($T$3:T106,1),\"\")","v":""},{"$f":"IFERROR(INDEX($S$3:$S$281,MATCH(ROWS($U$3:U106),$U$3:$U$281,0)),\"\")","v":""},{"$f":"IFERROR(INDEX($S$3:$S$281,MATCH(ROWS($U$3:V106),$U$3:$U$281,0)),\"\")","v":""},{"$f":"IFERROR(INDEX($S$3:$S$281,MATCH(ROWS($U$3:U106),$U$3:$U$281,0)),\"\")","v":""},null,{"$f":"$V$3:INDEX($V$3:$V$281,MAX($U$3:$U$281),1)","v":"Saltspring Island"}]
[null,null,null,null,null,null,null,null,null,null,null,null,null,null,null,null,null,null,"Hamilton",0,{"$f":"IF(T107=1,COUNTIF($T$3:T107,1),\"\")","v":""},{"$f":"IFERROR(INDEX($S$3:$S$281,MATCH(ROWS($U$3:U107),$U$3:$U$281,0)),\"\")","v":""},{"$f":"IFERROR(INDEX($S$3:$S$281,MATCH(ROWS($U$3:V107),$U$3:$U$281,0)),\"\")","v":""},{"$f":"IFERROR(INDEX($S$3:$S$281,MATCH(ROWS($U$3:U107),$U$3:$U$281,0)),\"\")","v":""},null,{"$f":"$V$3:INDEX($V$3:$V$281,MAX($U$3:$U$281),1)","v":"Saltspring Island"}]
[null,null,null,null,null,null,null,null,null,null,null,null,null,null,null,null,null,null,"Happy Valley - Goose Bay",0,{"$f":"IF(T108=1,COUNTIF($T$3:T108,1),\"\")","v":""},{"$f":"IFERROR(INDEX($S$3:$S$281,MATCH(ROWS($U$3:U108),$U$3:$U$281,0)),\"\")","v":""},{"$f":"IFERROR(INDEX($S$3:$S$281,MATCH(ROWS($U$3:V108),$U$3:$U$281,0)),\"\")","v":""},{"$f":"IFERROR(INDEX($S$3:$S$281,MATCH(ROWS($U$3:U108),$U$3:$U$281,0)),\"\")","v":""},null,{"$f":"$V$3:INDEX($V$3:$V$281,MAX($U$3:$U$281),1)","v":"Saltspring Island"}]
[null,null,null,null,null,null,null,null,null,null,null,null,null,null,null,null,null,null,"Harbour Breton",0,{"$f":"IF(T109=1,COUNTIF($T$3:T109,1),\"\")","v":""},{"$f":"IFERROR(INDEX($S$3:$S$281,MATCH(ROWS($U$3:U109),$U$3:$U$281,0)),\"\")","v":""},{"$f":"IFERROR(INDEX($S$3:$S$281,MATCH(ROWS($U$3:V109),$U$3:$U$281,0)),\"\")","v":""},{"$f":"IFERROR(INDEX($S$3:$S$281,MATCH(ROWS($U$3:U109),$U$3:$U$281,0)),\"\")","v":""},null,{"$f":"$V$3:INDEX($V$3:$V$281,MAX($U$3:$U$281),1)","v":"Saltspring Island"}]
[null,null,null,null,null,null,null,null,null,null,null,null,null,null,null,null,null,null,"Harbour Grace",0,{"$f":"IF(T110=1,COUNTIF($T$3:T110,1),\"\")","v":""},{"$f":"IFERROR(INDEX($S$3:$S$281,MATCH(ROWS($U$3:U110),$U$3:$U$281,0)),\"\")","v":""},{"$f":"IFERROR(INDEX($S$3:$S$281,MATCH(ROWS($U$3:V110),$U$3:$U$281,0)),\"\")","v":""},{"$f":"IFERROR(INDEX($S$3:$S$281,MATCH(ROWS($U$3:U110),$U$3:$U$281,0)),\"\")","v":""},null,{"$f":"$V$3:INDEX($V$3:$V$281,MAX($U$3:$U$281),1)","v":"Saltspring Island"}]
[null,null,null,null,null,null,null,null,null,null,null,null,null,null,null,null,null,null,"High Level",0,{"$f":"IF(T111=1,COUNTIF($T$3:T111,1),\"\")","v":""},{"$f":"IFERROR(INDEX($S$3:$S$281,MATCH(ROWS($U$3:U111),$U$3:$U$281,0)),\"\")","v":""},{"$f":"IFERROR(INDEX($S$3:$S$281,MATCH(ROWS($U$3:V111),$U$3:$U$281,0)),\"\")","v":""},{"$f":"IFERROR(INDEX($S$3:$S$281,MATCH(ROWS($U$3:U111),$U$3:$U$281,0)),\"\")","v":""},null,{"$f":"$V$3:INDEX($V$3:$V$281,MAX($U$3:$U$281),1)","v":"Saltspring Island"}]
[null,null,null,null,null,null,null,null,null,null,null,null,null,null,null,null,null,null,"Hodgson",0,{"$f":"IF(T112=1,COUNTIF($T$3:T112,1),\"\")","v":""},{"$f":"IFERROR(INDEX($S$3:$S$281,MATCH(ROWS($U$3:U112),$U$3:$U$281,0)),\"\")","v":""},{"$f":"IFERROR(INDEX($S$3:$S$281,MATCH(ROWS($U$3:V112),$U$3:$U$281,0)),\"\")","v":""},{"$f":"IFERROR(INDEX($S$3:$S$281,MATCH(ROWS($U$3:U112),$U$3:$U$281,0)),\"\")","v":""},null,{"$f":"$V$3:INDEX($V$3:$V$281,MAX($U$3:$U$281),1)","v":"Saltspring Island"}]
[null,null,null,null,null,null,null,null,null,null,null,null,null,null,null,null,null,null,"Huntsville",0,{"$f":"IF(T113=1,COUNTIF($T$3:T113,1),\"\")","v":""},{"$f":"IFERROR(INDEX($S$3:$S$281,MATCH(ROWS($U$3:U113),$U$3:$U$281,0)),\"\")","v":""},{"$f":"IFERROR(INDEX($S$3:$S$281,MATCH(ROWS($U$3:V113),$U$3:$U$281,0)),\"\")","v":""},{"$f":"IFERROR(INDEX($S$3:$S$281,MATCH(ROWS($U$3:U113),$U$3:$U$281,0)),\"\")","v":""},null,{"$f":"$V$3:INDEX($V$3:$V$281,MAX($U$3:$U$281),1)","v":"Saltspring Island"}]
[null,null,null,null,null,null,null,null,null,null,null,null,null,null,null,null,null,null,"Iles de la Madeleine",0,{"$f":"IF(T114=1,COUNTIF($T$3:T114,1),\"\")","v":""},{"$f":"IFERROR(INDEX($S$3:$S$281,MATCH(ROWS($U$3:U114),$U$3:$U$281,0)),\"\")","v":""},{"$f":"IFERROR(INDEX($S$3:$S$281,MATCH(ROWS($U$3:V114),$U$3:$U$281,0)),\"\")","v":""},{"$f":"IFERROR(INDEX($S$3:$S$281,MATCH(ROWS($U$3:U114),$U$3:$U$281,0)),\"\")","v":""},null,{"$f":"$V$3:INDEX($V$3:$V$281,MAX($U$3:$U$281),1)","v":"Saltspring Island"}]
[null,null,null,null,null,null,null,null,null,null,null,null,null,null,null,null,null,null,"Ingonish Beach",0,{"$f":"IF(T115=1,COUNTIF($T$3:T115,1),\"\")","v":""},{"$f":"IFERROR(INDEX($S$3:$S$281,MATCH(ROWS($U$3:U115),$U$3:$U$281,0)),\"\")","v":""},{"$f":"IFERROR(INDEX($S$3:$S$281,MATCH(ROWS($U$3:V115),$U$3:$U$281,0)),\"\")","v":""},{"$f":"IFERROR(INDEX($S$3:$S$281,MATCH(ROWS($U$3:U115),$U$3:$U$281,0)),\"\")","v":""},null,{"$f":"$V$3:INDEX($V$3:$V$281,MAX($U$3:$U$281),1)","v":"Saltspring Island"}]
[null,null,null,null,null,null,null,null,null,null,null,null,null,null,null,null,null,null,"Inukjuak",0,{"$f":"IF(T116=1,COUNTIF($T$3:T116,1),\"\")","v":""},{"$f":"IFERROR(INDEX($S$3:$S$281,MATCH(ROWS($U$3:U116),$U$3:$U$281,0)),\"\")","v":""},{"$f":"IFERROR(INDEX($S$3:$S$281,MATCH(ROWS($U$3:V116),$U$3:$U$281,0)),\"\")","v":""},{"$f":"IFERROR(INDEX($S$3:$S$281,MATCH(ROWS($U$3:U116),$U$3:$U$281,0)),\"\")","v":""},null,{"$f":"$V$3:INDEX($V$3:$V$281,MAX($U$3:$U$281),1)","v":"Saltspring Island"}]
[null,null,null,null,null,null,null,null,null,null,null,null,null,null,null,null,null,null,"Jasper",0,{"$f":"IF(T117=1,COUNTIF($T$3:T117,1),\"\")","v":""},{"$f":"IFERROR(INDEX($S$3:$S$281,MATCH(ROWS($U$3:U117),$U$3:$U$281,0)),\"\")","v":""},{"$f":"IFERROR(INDEX($S$3:$S$281,MATCH(ROWS($U$3:V117),$U$3:$U$281,0)),\"\")","v":""},{"$f":"IFERROR(INDEX($S$3:$S$281,MATCH(ROWS($U$3:U117),$U$3:$U$281,0)),\"\")","v":""},null,{"$f":"$V$3:INDEX($V$3:$V$281,MAX($U$3:$U$281),1)","v":"Saltspring Island"}]
[null,null,null,null,null,null,null,null,null,null,null,null,null,null,null,null,null,null,"Joliette",0,{"$f":"IF(T118=1,COUNTIF($T$3:T118,1),\"\")","v":""},{"$f":"IFERROR(INDEX($S$3:$S$281,MATCH(ROWS($U$3:U118),$U$3:$U$281,0)),\"\")","v":""},{"$f":"IFERROR(INDEX($S$3:$S$281,MATCH(ROWS($U$3:V118),$U$3:$U$281,0)),\"\")","v":""},{"$f":"IFERROR(INDEX($S$3:$S$281,MATCH(ROWS($U$3:U118),$U$3:$U$281,0)),\"\")","v":""},null,{"$f":"$V$3:INDEX($V$3:$V$281,MAX($U$3:$U$281),1)","v":"Saltspring Island"}]
[null,null,null,null,null,null,null,null,null,null,null,null,null,null,null,null,null,null,"Kamloops",0,{"$f":"IF(T119=1,COUNTIF($T$3:T119,1),\"\")","v":""},{"$f":"IFERROR(INDEX($S$3:$S$281,MATCH(ROWS($U$3:U119),$U$3:$U$281,0)),\"\")","v":""},{"$f":"IFERROR(INDEX($S$3:$S$281,MATCH(ROWS($U$3:V119),$U$3:$U$281,0)),\"\")","v":""},{"$f":"IFERROR(INDEX($S$3:$S$281,MATCH(ROWS($U$3:U119),$U$3:$U$281,0)),\"\")","v":""},null,{"$f":"$V$3:INDEX($V$3:$V$281,MAX($U$3:$U$281),1)","v":"Saltspring Island"}]
[null,null,null,null,null,null,null,null,null,null,null,null,null,null,null,null,null,null,"Kapuskasing",0,{"$f":"IF(T120=1,COUNTIF($T$3:T120,1),\"\")","v":""},{"$f":"IFERROR(INDEX($S$3:$S$281,MATCH(ROWS($U$3:U120),$U$3:$U$281,0)),\"\")","v":""},{"$f":"IFERROR(INDEX($S$3:$S$281,MATCH(ROWS($U$3:V120),$U$3:$U$281,0)),\"\")","v":""},{"$f":"IFERROR(INDEX($S$3:$S$281,MATCH(ROWS($U$3:U120),$U$3:$U$281,0)),\"\")","v":""},null,{"$f":"$V$3:INDEX($V$3:$V$281,MAX($U$3:$U$281),1)","v":"Saltspring Island"}]
[null,null,null,null,null,null,null,null,null,null,null,null,null,null,null,null,null,null,"Kedgwick",0,{"$f":"IF(T121=1,COUNTIF($T$3:T121,1),\"\")","v":""},{"$f":"IFERROR(INDEX($S$3:$S$281,MATCH(ROWS($U$3:U121),$U$3:$U$281,0)),\"\")","v":""},{"$f":"IFERROR(INDEX($S$3:$S$281,MATCH(ROWS($U$3:V121),$U$3:$U$281,0)),\"\")","v":""},{"$f":"IFERROR(INDEX($S$3:$S$281,MATCH(ROWS($U$3:U121),$U$3:$U$281,0)),\"\")","v":""},null,{"$f":"$V$3:INDEX($V$3:$V$281,MAX($U$3:$U$281),1)","v":"Saltspring Island"}]
[null,null,null,null,null,null,null,null,null,null,null,null,null,null,null,null,null,null,"Kejimkujik National Park",0,{"$f":"IF(T122=1,COUNTIF($T$3:T122,1),\"\")","v":""},{"$f":"IFERROR(INDEX($S$3:$S$281,MATCH(ROWS($U$3:U122),$U$3:$U$281,0)),\"\")","v":""},{"$f":"IFERROR(INDEX($S$3:$S$281,MATCH(ROWS($U$3:V122),$U$3:$U$281,0)),\"\")","v":""},{"$f":"IFERROR(INDEX($S$3:$S$281,MATCH(ROWS($U$3:U122),$U$3:$U$281,0)),\"\")","v":""},null,{"$f":"$V$3:INDEX($V$3:$V$281,MAX($U$3:$U$281),1)","v":"Saltspring Island"}]
[null,null,null,null,null,null,null,null,null,null,null,null,null,null,null,null,null,null,"Kelowna",0,{"$f":"IF(T123=1,COUNTIF($T$3:T123,1),\"\")","v":""},{"$f":"IFERROR(INDEX($S$3:$S$281,MATCH(ROWS($U$3:U123),$U$3:$U$281,0)),\"\")","v":""},{"$f":"IFERROR(INDEX($S$3:$S$281,MATCH(ROWS($U$3:V123),$U$3:$U$281,0)),\"\")","v":""},{"$f":"IFERROR(INDEX($S$3:$S$281,MATCH(ROWS($U$3:U123),$U$3:$U$281,0)),\"\")","v":""},null,{"$f":"$V$3:INDEX($V$3:$V$281,MAX($U$3:$U$281),1)","v":"Saltspring Island"}]
[null,null,null,null,null,null,null,null,null,null,null,null,null,null,null,null,null,null,"Kenora",0,{"$f":"IF(T124=1,COUNTIF($T$3:T124,1),\"\")","v":""},{"$f":"IFERROR(INDEX($S$3:$S$281,MATCH(ROWS($U$3:U124),$U$3:$U$281,0)),\"\")","v":""},{"$f":"IFERROR(INDEX($S$3:$S$281,MATCH(ROWS($U$3:V124),$U$3:$U$281,0)),\"\")","v":""},{"$f":"IFERROR(INDEX($S$3:$S$281,MATCH(ROWS($U$3:U124),$U$3:$U$281,0)),\"\")","v":""},null,{"$f":"$V$3:INDEX($V$3:$V$281,MAX($U$3:$U$281),1)","v":"Saltspring Island"}]
[null,null,null,null,null,null,null,null,null,null,null,null,null,null,null,null,null,null,"Kentville",0,{"$f":"IF(T125=1,COUNTIF($T$3:T125,1),\"\")","v":""},{"$f":"IFERROR(INDEX($S$3:$S$281,MATCH(ROWS($U$3:U125),$U$3:$U$281,0)),\"\")","v":""},{"$f":"IFERROR(INDEX($S$3:$S$281,MATCH(ROWS($U$3:V125),$U$3:$U$281,0)),\"\")","v":""},{"$f":"IFERROR(INDEX($S$3:$S$281,MATCH(ROWS($U$3:U125),$U$3:$U$281,0)),\"\")","v":""},null,{"$f":"$V$3:INDEX($V$3:$V$281,MAX($U$3:$U$281),1)","v":"Saltspring Island"}]
[null,null,null,null,null,null,null,null,null,null,null,null,null,null,null,null,null,null,"Kindersley",0,{"$f":"IF(T126=1,COUNTIF($T$3:T126,1),\"\")","v":""},{"$f":"IFERROR(INDEX($S$3:$S$281,MATCH(ROWS($U$3:U126),$U$3:$U$281,0)),\"\")","v":""},{"$f":"IFERROR(INDEX($S$3:$S$281,MATCH(ROWS($U$3:V126),$U$3:$U$281,0)),\"\")","v":""},{"$f":"IFERROR(INDEX($S$3:$S$281,MATCH(ROWS($U$3:U126),$U$3:$U$281,0)),\"\")","v":""},null,{"$f":"$V$3:INDEX($V$3:$V$281,MAX($U$3:$U$281),1)","v":"Saltspring Island"}]
[null,null,null,null,null,null,null,null,null,null,null,null,null,null,null,null,null,null,"Kingston",0,{"$f":"IF(T127=1,COUNTIF($T$3:T127,1),\"\")","v":""},{"$f":"IFERROR(INDEX($S$3:$S$281,MATCH(ROWS($U$3:U127),$U$3:$U$281,0)),\"\")","v":""},{"$f":"IFERROR(INDEX($S$3:$S$281,MATCH(ROWS($U$3:V127),$U$3:$U$281,0)),\"\")","v":""},{"$f":"IFERROR(INDEX($S$3:$S$281,MATCH(ROWS($U$3:U127),$U$3:$U$281,0)),\"\")","v":""},null,{"$f":"$V$3:INDEX($V$3:$V$281,MAX($U$3:$U$281),1)","v":"Saltspring Island"}]
[null,null,null,null,null,null,null,null,null,null,null,null,null,null,null,null,null,null,"Kouchibouguac National Park",0,{"$f":"IF(T128=1,COUNTIF($T$3:T128,1),\"\")","v":""},{"$f":"IFERROR(INDEX($S$3:$S$281,MATCH(ROWS($U$3:U128),$U$3:$U$281,0)),\"\")","v":""},{"$f":"IFERROR(INDEX($S$3:$S$281,MATCH(ROWS($U$3:V128),$U$3:$U$281,0)),\"\")","v":""},{"$f":"IFERROR(INDEX($S$3:$S$281,MATCH(ROWS($U$3:U128),$U$3:$U$281,0)),\"\")","v":""},null,{"$f":"$V$3:INDEX($V$3:$V$281,MAX($U$3:$U$281),1)","v":"Saltspring Island"}]
[null,null,null,null,null,null,null,null,null,null,null,null,null,null,null,null,null,null,"Kuujjuaq",0,{"$f":"IF(T129=1,COUNTIF($T$3:T129,1),\"\")","v":""},{"$f":"IFERROR(INDEX($S$3:$S$281,MATCH(ROWS($U$3:U129),$U$3:$U$281,0)),\"\")","v":""},{"$f":"IFERROR(INDEX($S$3:$S$281,MATCH(ROWS($U$3:V129),$U$3:$U$281,0)),\"\")","v":""},{"$f":"IFERROR(INDEX($S$3:$S$281,MATCH(ROWS($U$3:U129),$U$3:$U$281,0)),\"\")","v":""},null,{"$f":"$V$3:INDEX($V$3:$V$281,MAX($U$3:$U$281),1)","v":"Saltspring Island"}]
[null,null,null,null,null,null,null,null,null,null,null,null,null,null,null,null,null,null,"Kuujjuarapik",0,{"$f":"IF(T130=1,COUNTIF($T$3:T130,1),\"\")","v":""},{"$f":"IFERROR(INDEX($S$3:$S$281,MATCH(ROWS($U$3:U130),$U$3:$U$281,0)),\"\")","v":""},{"$f":"IFERROR(INDEX($S$3:$S$281,MATCH(ROWS($U$3:V130),$U$3:$U$281,0)),\"\")","v":""},{"$f":"IFERROR(INDEX($S$3:$S$281,MATCH(ROWS($U$3:U130),$U$3:$U$281,0)),\"\")","v":""},null,{"$f":"$V$3:INDEX($V$3:$V$281,MAX($U$3:$U$281),1)","v":"Saltspring Island"}]
[null,null,null,null,null,null,null,null,null,null,null,null,null,null,null,null,null,null,"La Ronge",0,{"$f":"IF(T131=1,COUNTIF($T$3:T131,1),\"\")","v":""},{"$f":"IFERROR(INDEX($S$3:$S$281,MATCH(ROWS($U$3:U131),$U$3:$U$281,0)),\"\")","v":""},{"$f":"IFERROR(INDEX($S$3:$S$281,MATCH(ROWS($U$3:V131),$U$3:$U$281,0)),\"\")","v":""},{"$f":"IFERROR(INDEX($S$3:$S$281,MATCH(ROWS($U$3:U131),$U$3:$U$281,0)),\"\")","v":""},null,{"$f":"$V$3:INDEX($V$3:$V$281,MAX($U$3:$U$281),1)","v":"Saltspring Island"}]
[null,null,null,null,null,null,null,null,null,null,null,null,null,null,null,null,null,null,"La Tuque",0,{"$f":"IF(T132=1,COUNTIF($T$3:T132,1),\"\")","v":""},{"$f":"IFERROR(INDEX($S$3:$S$281,MATCH(ROWS($U$3:U132),$U$3:$U$281,0)),\"\")","v":""},{"$f":"IFERROR(INDEX($S$3:$S$281,MATCH(ROWS($U$3:V132),$U$3:$U$281,0)),\"\")","v":""},{"$f":"IFERROR(INDEX($S$3:$S$281,MATCH(ROWS($U$3:U132),$U$3:$U$281,0)),\"\")","v":""},null,{"$f":"$V$3:INDEX($V$3:$V$281,MAX($U$3:$U$281),1)","v":"Saltspring Island"}]
[null,null,null,null,null,null,null,null,null,null,null,null,null,null,null,null,null,null,"Lachute",0,{"$f":"IF(T133=1,COUNTIF($T$3:T133,1),\"\")","v":""},{"$f":"IFERROR(INDEX($S$3:$S$281,MATCH(ROWS($U$3:U133),$U$3:$U$281,0)),\"\")","v":""},{"$f":"IFERROR(INDEX($S$3:$S$281,MATCH(ROWS($U$3:V133),$U$3:$U$281,0)),\"\")","v":""},{"$f":"IFERROR(INDEX($S$3:$S$281,MATCH(ROWS($U$3:U133),$U$3:$U$281,0)),\"\")","v":""},null,{"$f":"$V$3:INDEX($V$3:$V$281,MAX($U$3:$U$281),1)","v":"Saltspring Island"}]
[null,null,null,null,null,null,null,null,null,null,null,null,null,null,null,null,null,null,"Last Mountain Lake",0,{"$f":"IF(T134=1,COUNTIF($T$3:T134,1),\"\")","v":""},{"$f":"IFERROR(INDEX($S$3:$S$281,MATCH(ROWS($U$3:U134),$U$3:$U$281,0)),\"\")","v":""},{"$f":"IFERROR(INDEX($S$3:$S$281,MATCH(ROWS($U$3:V134),$U$3:$U$281,0)),\"\")","v":""},{"$f":"IFERROR(INDEX($S$3:$S$281,MATCH(ROWS($U$3:U134),$U$3:$U$281,0)),\"\")","v":""},null,{"$f":"$V$3:INDEX($V$3:$V$281,MAX($U$3:$U$281),1)","v":"Saltspring Island"}]
[null,null,null,null,null,null,null,null,null,null,null,null,null,null,null,null,null,null,"Lethbridge",0,{"$f":"IF(T135=1,COUNTIF($T$3:T135,1),\"\")","v":""},{"$f":"IFERROR(INDEX($S$3:$S$281,MATCH(ROWS($U$3:U135),$U$3:$U$281,0)),\"\")","v":""},{"$f":"IFERROR(INDEX($S$3:$S$281,MATCH(ROWS($U$3:V135),$U$3:$U$281,0)),\"\")","v":""},{"$f":"IFERROR(INDEX($S$3:$S$281,MATCH(ROWS($U$3:U135),$U$3:$U$281,0)),\"\")","v":""},null,{"$f":"$V$3:INDEX($V$3:$V$281,MAX($U$3:$U$281),1)","v":"Saltspring Island"}]
[null,null,null,null,null,null,null,null,null,null,null,null,null,null,null,null,null,null,"Lillooet",0,{"$f":"IF(T136=1,COUNTIF($T$3:T136,1),\"\")","v":""},{"$f":"IFERROR(INDEX($S$3:$S$281,MATCH(ROWS($U$3:U136),$U$3:$U$281,0)),\"\")","v":""},{"$f":"IFERROR(INDEX($S$3:$S$281,MATCH(ROWS($U$3:V136),$U$3:$U$281,0)),\"\")","v":""},{"$f":"IFERROR(INDEX($S$3:$S$281,MATCH(ROWS($U$3:U136),$U$3:$U$281,0)),\"\")","v":""},null,{"$f":"$V$3:INDEX($V$3:$V$281,MAX($U$3:$U$281),1)","v":"Saltspring Island"}]
[null,null,null,null,null,null,null,null,null,null,null,null,null,null,null,null,null,null,"Liverpool - Milton",0,{"$f":"IF(T137=1,COUNTIF($T$3:T137,1),\"\")","v":""},{"$f":"IFERROR(INDEX($S$3:$S$281,MATCH(ROWS($U$3:U137),$U$3:$U$281,0)),\"\")","v":""},{"$f":"IFERROR(INDEX($S$3:$S$281,MATCH(ROWS($U$3:V137),$U$3:$U$281,0)),\"\")","v":""},{"$f":"IFERROR(INDEX($S$3:$S$281,MATCH(ROWS($U$3:U137),$U$3:$U$281,0)),\"\")","v":""},null,{"$f":"$V$3:INDEX($V$3:$V$281,MAX($U$3:$U$281),1)","v":"Saltspring Island"}]
[null,null,null,null,null,null,null,null,null,null,null,null,null,null,null,null,null,null,"Lloydminster",0,{"$f":"IF(T138=1,COUNTIF($T$3:T138,1),\"\")","v":""},{"$f":"IFERROR(INDEX($S$3:$S$281,MATCH(ROWS($U$3:U138),$U$3:$U$281,0)),\"\")","v":""},{"$f":"IFERROR(INDEX($S$3:$S$281,MATCH(ROWS($U$3:V138),$U$3:$U$281,0)),\"\")","v":""},{"$f":"IFERROR(INDEX($S$3:$S$281,MATCH(ROWS($U$3:U138),$U$3:$U$281,0)),\"\")","v":""},null,{"$f":"$V$3:INDEX($V$3:$V$281,MAX($U$3:$U$281),1)","v":"Saltspring Island"}]
[null,null,null,null,null,null,null,null,null,null,null,null,null,null,null,null,null,null,"Lloydminster",0,{"$f":"IF(T139=1,COUNTIF($T$3:T139,1),\"\")","v":""},{"$f":"IFERROR(INDEX($S$3:$S$281,MATCH(ROWS($U$3:U139),$U$3:$U$281,0)),\"\")","v":""},{"$f":"IFERROR(INDEX($S$3:$S$281,MATCH(ROWS($U$3:V139),$U$3:$U$281,0)),\"\")","v":""},{"$f":"IFERROR(INDEX($S$3:$S$281,MATCH(ROWS($U$3:U139),$U$3:$U$281,0)),\"\")","v":""},null,{"$f":"$V$3:INDEX($V$3:$V$281,MAX($U$3:$U$281),1)","v":"Saltspring Island"}]
[null,null,null,null,null,null,null,null,null,null,null,null,null,null,null,null,null,null,"London",0,{"$f":"IF(T140=1,COUNTIF($T$3:T140,1),\"\")","v":""},{"$f":"IFERROR(INDEX($S$3:$S$281,MATCH(ROWS($U$3:U140),$U$3:$U$281,0)),\"\")","v":""},{"$f":"IFERROR(INDEX($S$3:$S$281,MATCH(ROWS($U$3:V140),$U$3:$U$281,0)),\"\")","v":""},{"$f":"IFERROR(INDEX($S$3:$S$281,MATCH(ROWS($U$3:U140),$U$3:$U$281,0)),\"\")","v":""},null,{"$f":"$V$3:INDEX($V$3:$V$281,MAX($U$3:$U$281),1)","v":"Saltspring Island"}]
[null,null,null,null,null,null,null,null,null,null,null,null,null,null,null,null,null,null,"Long Harbour",0,{"$f":"IF(T141=1,COUNTIF($T$3:T141,1),\"\")","v":""},{"$f":"IFERROR(INDEX($S$3:$S$281,MATCH(ROWS($U$3:U141),$U$3:$U$281,0)),\"\")","v":""},{"$f":"IFERROR(INDEX($S$3:$S$281,MATCH(ROWS($U$3:V141),$U$3:$U$281,0)),\"\")","v":""},{"$f":"IFERROR(INDEX($S$3:$S$281,MATCH(ROWS($U$3:U141),$U$3:$U$281,0)),\"\")","v":""},null,{"$f":"$V$3:INDEX($V$3:$V$281,MAX($U$3:$U$281),1)","v":"Saltspring Island"}]
[null,null,null,null,null,null,null,null,null,null,null,null,null,null,null,null,null,null,"Long River",0,{"$f":"IF(T142=1,COUNTIF($T$3:T142,1),\"\")","v":""},{"$f":"IFERROR(INDEX($S$3:$S$281,MATCH(ROWS($U$3:U142),$U$3:$U$281,0)),\"\")","v":""},{"$f":"IFERROR(INDEX($S$3:$S$281,MATCH(ROWS($U$3:V142),$U$3:$U$281,0)),\"\")","v":""},{"$f":"IFERROR(INDEX($S$3:$S$281,MATCH(ROWS($U$3:U142),$U$3:$U$281,0)),\"\")","v":""},null,{"$f":"$V$3:INDEX($V$3:$V$281,MAX($U$3:$U$281),1)","v":"Saltspring Island"}]
[null,null,null,null,null,null,null,null,null,null,null,null,null,null,null,null,null,null,"Louisbourg",{"$f":"--ISNUMBER(IFERROR(SEARCH($K$2,S143,1),\"\"))","v":0},{"$f":"IF(T143=1,COUNTIF($T$3:T143,1),\"\")","v":""},{"$f":"IFERROR(INDEX($S$3:$S$281,MATCH(ROWS($U$3:U143),$U$3:$U$281,0)),\"\")","v":""},{"$f":"IFERROR(INDEX($S$3:$S$281,MATCH(ROWS($U$3:V143),$U$3:$U$281,0)),\"\")","v":""},{"$f":"IFERROR(INDEX($S$3:$S$281,MATCH(ROWS($U$3:U143),$U$3:$U$281,0)),\"\")","v":""},null,{"$f":"$V$3:INDEX($V$3:$V$281,MAX($U$3:$U$281),1)","v":"Saltspring Island"}]
[null,null,null,null,null,null,null,null,null,null,null,null,null,null,null,null,null,null,"Lynn Lake",0,{"$f":"IF(T144=1,COUNTIF($T$3:T144,1),\"\")","v":""},{"$f":"IFERROR(INDEX($S$3:$S$281,MATCH(ROWS($U$3:U144),$U$3:$U$281,0)),\"\")","v":""},{"$f":"IFERROR(INDEX($S$3:$S$281,MATCH(ROWS($U$3:V144),$U$3:$U$281,0)),\"\")","v":""},{"$f":"IFERROR(INDEX($S$3:$S$281,MATCH(ROWS($U$3:U144),$U$3:$U$281,0)),\"\")","v":""},null,{"$f":"$V$3:INDEX($V$3:$V$281,MAX($U$3:$U$281),1)","v":"Saltspring Island"}]
[null,null,null,null,null,null,null,null,null,null,null,null,null,null,null,null,null,null,"Mactaquac Provincial Park",0,{"$f":"IF(T145=1,COUNTIF($T$3:T145,1),\"\")","v":""},{"$f":"IFERROR(INDEX($S$3:$S$281,MATCH(ROWS($U$3:U145),$U$3:$U$281,0)),\"\")","v":""},{"$f":"IFERROR(INDEX($S$3:$S$281,MATCH(ROWS($U$3:V145),$U$3:$U$281,0)),\"\")","v":""},{"$f":"IFERROR(INDEX($S$3:$S$281,MATCH(ROWS($U$3:U145),$U$3:$U$281,0)),\"\")","v":""},null,{"$f":"$V$3:INDEX($V$3:$V$281,MAX($U$3:$U$281),1)","v":"Saltspring Island"}]
[null,null,null,null,null,null,null,null,null,null,null,null,null,null,null,null,null,null,"Makkovik",0,{"$f":"IF(T146=1,COUNTIF($T$3:T146,1),\"\")","v":""},{"$f":"IFERROR(INDEX($S$3:$S$281,MATCH(ROWS($U$3:U146),$U$3:$U$281,0)),\"\")","v":""},{"$f":"IFERROR(INDEX($S$3:$S$281,MATCH(ROWS($U$3:V146),$U$3:$U$281,0)),\"\")","v":""},{"$f":"IFERROR(INDEX($S$3:$S$281,MATCH(ROWS($U$3:U146),$U$3:$U$281,0)),\"\")","v":""},null,{"$f":"$V$3:INDEX($V$3:$V$281,MAX($U$3:$U$281),1)","v":"Saltspring Island"}]
[null,null,null,null,null,null,null,null,null,null,null,null,null,null,null,null,null,null,"Maniwaki",0,{"$f":"IF(T147=1,COUNTIF($T$3:T147,1),\"\")","v":""},{"$f":"IFERROR(INDEX($S$3:$S$281,MATCH(ROWS($U$3:U147),$U$3:$U$281,0)),\"\")","v":""},{"$f":"IFERROR(INDEX($S$3:$S$281,MATCH(ROWS($U$3:V147),$U$3:$U$281,0)),\"\")","v":""},{"$f":"IFERROR(INDEX($S$3:$S$281,MATCH(ROWS($U$3:U147),$U$3:$U$281,0)),\"\")","v":""},null,{"$f":"$V$3:INDEX($V$3:$V$281,MAX($U$3:$U$281),1)","v":"Saltspring Island"}]
[null,null,null,null,null,null,null,null,null,null,null,null,null,null,null,null,null,null,"Mary's Harbour",0,{"$f":"IF(T148=1,COUNTIF($T$3:T148,1),\"\")","v":""},{"$f":"IFERROR(INDEX($S$3:$S$281,MATCH(ROWS($U$3:U148),$U$3:$U$281,0)),\"\")","v":""},{"$f":"IFERROR(INDEX($S$3:$S$281,MATCH(ROWS($U$3:V148),$U$3:$U$281,0)),\"\")","v":""},{"$f":"IFERROR(INDEX($S$3:$S$281,MATCH(ROWS($U$3:U148),$U$3:$U$281,0)),\"\")","v":""},null,{"$f":"$V$3:INDEX($V$3:$V$281,MAX($U$3:$U$281),1)","v":"Saltspring Island"}]
[null,null,null,null,null,null,null,null,null,null,null,null,null,null,null,null,null,null,"Mayne Island, Village Bay",0,{"$f":"IF(T149=1,COUNTIF($T$3:T149,1),\"\")","v":""},{"$f":"IFERROR(INDEX($S$3:$S$281,MATCH(ROWS($U$3:U149),$U$3:$U$281,0)),\"\")","v":""},{"$f":"IFERROR(INDEX($S$3:$S$281,MATCH(ROWS($U$3:V149),$U$3:$U$281,0)),\"\")","v":""},{"$f":"IFERROR(INDEX($S$3:$S$281,MATCH(ROWS($U$3:U149),$U$3:$U$281,0)),\"\")","v":""},null,{"$f":"$V$3:INDEX($V$3:$V$281,MAX($U$3:$U$281),1)","v":"Saltspring Island"}]
[null,null,null,null,null,null,null,null,null,null,null,null,null,null,null,null,null,null,"McCreary",0,{"$f":"IF(T150=1,COUNTIF($T$3:T150,1),\"\")","v":""},{"$f":"IFERROR(INDEX($S$3:$S$281,MATCH(ROWS($U$3:U150),$U$3:$U$281,0)),\"\")","v":""},{"$f":"IFERROR(INDEX($S$3:$S$281,MATCH(ROWS($U$3:V150),$U$3:$U$281,0)),\"\")","v":""},{"$f":"IFERROR(INDEX($S$3:$S$281,MATCH(ROWS($U$3:U150),$U$3:$U$281,0)),\"\")","v":""},null,{"$f":"$V$3:INDEX($V$3:$V$281,MAX($U$3:$U$281),1)","v":"Saltspring Island"}]
[null,null,null,null,null,null,null,null,null,null,null,null,null,null,null,null,null,null,"Meadow Lake",0,{"$f":"IF(T151=1,COUNTIF($T$3:T151,1),\"\")","v":""},{"$f":"IFERROR(INDEX($S$3:$S$281,MATCH(ROWS($U$3:U151),$U$3:$U$281,0)),\"\")","v":""},{"$f":"IFERROR(INDEX($S$3:$S$281,MATCH(ROWS($U$3:V151),$U$3:$U$281,0)),\"\")","v":""},{"$f":"IFERROR(INDEX($S$3:$S$281,MATCH(ROWS($U$3:U151),$U$3:$U$281,0)),\"\")","v":""},null,{"$f":"$V$3:INDEX($V$3:$V$281,MAX($U$3:$U$281),1)","v":"Saltspring Island"}]
[null,null,null,null,null,null,null,null,null,null,null,null,null,null,null,null,null,null,"Medicine Hat",0,{"$f":"IF(T152=1,COUNTIF($T$3:T152,1),\"\")","v":""},{"$f":"IFERROR(INDEX($S$3:$S$281,MATCH(ROWS($U$3:U152),$U$3:$U$281,0)),\"\")","v":""},{"$f":"IFERROR(INDEX($S$3:$S$281,MATCH(ROWS($U$3:V152),$U$3:$U$281,0)),\"\")","v":""},{"$f":"IFERROR(INDEX($S$3:$S$281,MATCH(ROWS($U$3:U152),$U$3:$U$281,0)),\"\")","v":""},null,{"$f":"$V$3:INDEX($V$3:$V$281,MAX($U$3:$U$281),1)","v":"Saltspring Island"}]
[null,null,null,null,null,null,null,null,null,null,null,null,null,null,null,null,null,null,"Melfort",0,{"$f":"IF(T153=1,COUNTIF($T$3:T153,1),\"\")","v":""},{"$f":"IFERROR(INDEX($S$3:$S$281,MATCH(ROWS($U$3:U153),$U$3:$U$281,0)),\"\")","v":""},{"$f":"IFERROR(INDEX($S$3:$S$281,MATCH(ROWS($U$3:V153),$U$3:$U$281,0)),\"\")","v":""},{"$f":"IFERROR(INDEX($S$3:$S$281,MATCH(ROWS($U$3:U153),$U$3:$U$281,0)),\"\")","v":""},null,{"$f":"$V$3:INDEX($V$3:$V$281,MAX($U$3:$U$281),1)","v":"Saltspring Island"}]
[null,null,null,null,null,null,null,null,null,null,null,null,null,null,null,null,null,null,"Midland",0,{"$f":"IF(T154=1,COUNTIF($T$3:T154,1),\"\")","v":""},{"$f":"IFERROR(INDEX($S$3:$S$281,MATCH(ROWS($U$3:U154),$U$3:$U$281,0)),\"\")","v":""},{"$f":"IFERROR(INDEX($S$3:$S$281,MATCH(ROWS($U$3:V154),$U$3:$U$281,0)),\"\")","v":""},{"$f":"IFERROR(INDEX($S$3:$S$281,MATCH(ROWS($U$3:U154),$U$3:$U$281,0)),\"\")","v":""},null,{"$f":"$V$3:INDEX($V$3:$V$281,MAX($U$3:$U$281),1)","v":"Saltspring Island"}]
[null,null,null,null,null,null,null,null,null,null,null,null,null,null,null,null,null,null,"Miramichi",0,{"$f":"IF(T155=1,COUNTIF($T$3:T155,1),\"\")","v":""},{"$f":"IFERROR(INDEX($S$3:$S$281,MATCH(ROWS($U$3:U155),$U$3:$U$281,0)),\"\")","v":""},{"$f":"IFERROR(INDEX($S$3:$S$281,MATCH(ROWS($U$3:V155),$U$3:$U$281,0)),\"\")","v":""},{"$f":"IFERROR(INDEX($S$3:$S$281,MATCH(ROWS($U$3:U155),$U$3:$U$281,0)),\"\")","v":""},null,{"$f":"$V$3:INDEX($V$3:$V$281,MAX($U$3:$U$281),1)","v":"Saltspring Island"}]
[null,null,null,null,null,null,null,null,null,null,null,null,null,null,null,null,null,null,"Moncton",0,{"$f":"IF(T156=1,COUNTIF($T$3:T156,1),\"\")","v":""},{"$f":"IFERROR(INDEX($S$3:$S$281,MATCH(ROWS($U$3:U156),$U$3:$U$281,0)),\"\")","v":""},{"$f":"IFERROR(INDEX($S$3:$S$281,MATCH(ROWS($U$3:V156),$U$3:$U$281,0)),\"\")","v":""},{"$f":"IFERROR(INDEX($S$3:$S$281,MATCH(ROWS($U$3:U156),$U$3:$U$281,0)),\"\")","v":""},null,{"$f":"$V$3:INDEX($V$3:$V$281,MAX($U$3:$U$281),1)","v":"Saltspring Island"}]
[null,null,null,null,null,null,null,null,null,null,null,null,null,null,null,null,null,null,"Mont Laurier",0,{"$f":"IF(T157=1,COUNTIF($T$3:T157,1),\"\")","v":""},{"$f":"IFERROR(INDEX($S$3:$S$281,MATCH(ROWS($U$3:U157),$U$3:$U$281,0)),\"\")","v":""},{"$f":"IFERROR(INDEX($S$3:$S$281,MATCH(ROWS($U$3:V157),$U$3:$U$281,0)),\"\")","v":""},{"$f":"IFERROR(INDEX($S$3:$S$281,MATCH(ROWS($U$3:U157),$U$3:$U$281,0)),\"\")","v":""},null,{"$f":"$V$3:INDEX($V$3:$V$281,MAX($U$3:$U$281),1)","v":"Saltspring Island"}]
[null,null,null,null,null,null,null,null,null,null,null,null,null,null,null,null,null,null,"Monticello",0,{"$f":"IF(T158=1,COUNTIF($T$3:T158,1),\"\")","v":""},{"$f":"IFERROR(INDEX($S$3:$S$281,MATCH(ROWS($U$3:U158),$U$3:$U$281,0)),\"\")","v":""},{"$f":"IFERROR(INDEX($S$3:$S$281,MATCH(ROWS($U$3:V158),$U$3:$U$281,0)),\"\")","v":""},{"$f":"IFERROR(INDEX($S$3:$S$281,MATCH(ROWS($U$3:U158),$U$3:$U$281,0)),\"\")","v":""},null,{"$f":"$V$3:INDEX($V$3:$V$281,MAX($U$3:$U$281),1)","v":"Saltspring Island"}]
[null,null,null,null,null,null,null,null,null,null,null,null,null,null,null,null,null,null,"Montréal",0,{"$f":"IF(T159=1,COUNTIF($T$3:T159,1),\"\")","v":""},{"$f":"IFERROR(INDEX($S$3:$S$281,MATCH(ROWS($U$3:U159),$U$3:$U$281,0)),\"\")","v":""},{"$f":"IFERROR(INDEX($S$3:$S$281,MATCH(ROWS($U$3:V159),$U$3:$U$281,0)),\"\")","v":""},{"$f":"IFERROR(INDEX($S$3:$S$281,MATCH(ROWS($U$3:U159),$U$3:$U$281,0)),\"\")","v":""},null,{"$f":"$V$3:INDEX($V$3:$V$281,MAX($U$3:$U$281),1)","v":"Saltspring Island"}]
[null,null,null,null,null,null,null,null,null,null,null,null,null,null,null,null,null,null,"Moose Jaw",0,{"$f":"IF(T160=1,COUNTIF($T$3:T160,1),\"\")","v":""},{"$f":"IFERROR(INDEX($S$3:$S$281,MATCH(ROWS($U$3:U160),$U$3:$U$281,0)),\"\")","v":""},{"$f":"IFERROR(INDEX($S$3:$S$281,MATCH(ROWS($U$3:V160),$U$3:$U$281,0)),\"\")","v":""},{"$f":"IFERROR(INDEX($S$3:$S$281,MATCH(ROWS($U$3:U160),$U$3:$U$281,0)),\"\")","v":""},null,{"$f":"$V$3:INDEX($V$3:$V$281,MAX($U$3:$U$281),1)","v":"Saltspring Island"}]
[null,null,null,null,null,null,null,null,null,null,null,null,null,null,null,null,null,null,"Moosomin",0,{"$f":"IF(T161=1,COUNTIF($T$3:T161,1),\"\")","v":""},{"$f":"IFERROR(INDEX($S$3:$S$281,MATCH(ROWS($U$3:U161),$U$3:$U$281,0)),\"\")","v":""},{"$f":"IFERROR(INDEX($S$3:$S$281,MATCH(ROWS($U$3:V161),$U$3:$U$281,0)),\"\")","v":""},{"$f":"IFERROR(INDEX($S$3:$S$281,MATCH(ROWS($U$3:U161),$U$3:$U$281,0)),\"\")","v":""},null,{"$f":"$V$3:INDEX($V$3:$V$281,MAX($U$3:$U$281),1)","v":"Saltspring Island"}]
[null,null,null,null,null,null,null,null,null,null,null,null,null,null,null,null,null,null,"Moosonee",0,{"$f":"IF(T162=1,COUNTIF($T$3:T162,1),\"\")","v":""},{"$f":"IFERROR(INDEX($S$3:$S$281,MATCH(ROWS($U$3:U162),$U$3:$U$281,0)),\"\")","v":""},{"$f":"IFERROR(INDEX($S$3:$S$281,MATCH(ROWS($U$3:V162),$U$3:$U$281,0)),\"\")","v":""},{"$f":"IFERROR(INDEX($S$3:$S$281,MATCH(ROWS($U$3:U162),$U$3:$U$281,0)),\"\")","v":""},null,{"$f":"$V$3:INDEX($V$3:$V$281,MAX($U$3:$U$281),1)","v":"Saltspring Island"}]
[null,null,null,null,null,null,null,null,null,null,null,null,null,null,null,null,null,null,"Morden",0,{"$f":"IF(T163=1,COUNTIF($T$3:T163,1),\"\")","v":""},{"$f":"IFERROR(INDEX($S$3:$S$281,MATCH(ROWS($U$3:U163),$U$3:$U$281,0)),\"\")","v":""},{"$f":"IFERROR(INDEX($S$3:$S$281,MATCH(ROWS($U$3:V163),$U$3:$U$281,0)),\"\")","v":""},{"$f":"IFERROR(INDEX($S$3:$S$281,MATCH(ROWS($U$3:U163),$U$3:$U$281,0)),\"\")","v":""},null,{"$f":"$V$3:INDEX($V$3:$V$281,MAX($U$3:$U$281),1)","v":"Saltspring Island"}]
[null,null,null,null,null,null,null,null,null,null,null,null,null,null,null,null,null,null,"Mount Carleton Provincial Park",0,{"$f":"IF(T164=1,COUNTIF($T$3:T164,1),\"\")","v":""},{"$f":"IFERROR(INDEX($S$3:$S$281,MATCH(ROWS($U$3:U164),$U$3:$U$281,0)),\"\")","v":""},{"$f":"IFERROR(INDEX($S$3:$S$281,MATCH(ROWS($U$3:V164),$U$3:$U$281,0)),\"\")","v":""},{"$f":"IFERROR(INDEX($S$3:$S$281,MATCH(ROWS($U$3:U164),$U$3:$U$281,0)),\"\")","v":""},null,{"$f":"$V$3:INDEX($V$3:$V$281,MAX($U$3:$U$281),1)","v":"Saltspring Island"}]
[null,null,null,null,null,null,null,null,null,null,null,null,null,null,null,null,null,null,"Musgrave Harbour",0,{"$f":"IF(T165=1,COUNTIF($T$3:T165,1),\"\")","v":""},{"$f":"IFERROR(INDEX($S$3:$S$281,MATCH(ROWS($U$3:U165),$U$3:$U$281,0)),\"\")","v":""},{"$f":"IFERROR(INDEX($S$3:$S$281,MATCH(ROWS($U$3:V165),$U$3:$U$281,0)),\"\")","v":""},{"$f":"IFERROR(INDEX($S$3:$S$281,MATCH(ROWS($U$3:U165),$U$3:$U$281,0)),\"\")","v":""},null,{"$f":"$V$3:INDEX($V$3:$V$281,MAX($U$3:$U$281),1)","v":"Saltspring Island"}]
[null,null,null,null,null,null,null,null,null,null,null,null,null,null,null,null,null,null,"Nain",0,{"$f":"IF(T166=1,COUNTIF($T$3:T166,1),\"\")","v":""},{"$f":"IFERROR(INDEX($S$3:$S$281,MATCH(ROWS($U$3:U166),$U$3:$U$281,0)),\"\")","v":""},{"$f":"IFERROR(INDEX($S$3:$S$281,MATCH(ROWS($U$3:V166),$U$3:$U$281,0)),\"\")","v":""},{"$f":"IFERROR(INDEX($S$3:$S$281,MATCH(ROWS($U$3:U166),$U$3:$U$281,0)),\"\")","v":""},null,{"$f":"$V$3:INDEX($V$3:$V$281,MAX($U$3:$U$281),1)","v":"Saltspring Island"}]
[null,null,null,null,null,null,null,null,null,null,null,null,null,null,null,null,null,null,"Nanaimo",0,{"$f":"IF(T167=1,COUNTIF($T$3:T167,1),\"\")","v":""},{"$f":"IFERROR(INDEX($S$3:$S$281,MATCH(ROWS($U$3:U167),$U$3:$U$281,0)),\"\")","v":""},{"$f":"IFERROR(INDEX($S$3:$S$281,MATCH(ROWS($U$3:V167),$U$3:$U$281,0)),\"\")","v":""},{"$f":"IFERROR(INDEX($S$3:$S$281,MATCH(ROWS($U$3:U167),$U$3:$U$281,0)),\"\")","v":""},null,{"$f":"$V$3:INDEX($V$3:$V$281,MAX($U$3:$U$281),1)","v":"Saltspring Island"}]
[null,null,null,null,null,null,null,null,null,null,null,null,null,null,null,null,null,null,"Natashquan",0,{"$f":"IF(T168=1,COUNTIF($T$3:T168,1),\"\")","v":""},{"$f":"IFERROR(INDEX($S$3:$S$281,MATCH(ROWS($U$3:U168),$U$3:$U$281,0)),\"\")","v":""},{"$f":"IFERROR(INDEX($S$3:$S$281,MATCH(ROWS($U$3:V168),$U$3:$U$281,0)),\"\")","v":""},{"$f":"IFERROR(INDEX($S$3:$S$281,MATCH(ROWS($U$3:U168),$U$3:$U$281,0)),\"\")","v":""},null,{"$f":"$V$3:INDEX($V$3:$V$281,MAX($U$3:$U$281),1)","v":"Saltspring Island"}]
[null,null,null,null,null,null,null,null,null,null,null,null,null,null,null,null,null,null,"New Glasgow",0,{"$f":"IF(T169=1,COUNTIF($T$3:T169,1),\"\")","v":""},{"$f":"IFERROR(INDEX($S$3:$S$281,MATCH(ROWS($U$3:U169),$U$3:$U$281,0)),\"\")","v":""},{"$f":"IFERROR(INDEX($S$3:$S$281,MATCH(ROWS($U$3:V169),$U$3:$U$281,0)),\"\")","v":""},{"$f":"IFERROR(INDEX($S$3:$S$281,MATCH(ROWS($U$3:U169),$U$3:$U$281,0)),\"\")","v":""},null,{"$f":"$V$3:INDEX($V$3:$V$281,MAX($U$3:$U$281),1)","v":"Saltspring Island"}]
[null,null,null,null,null,null,null,null,null,null,null,null,null,null,null,null,null,null,"Niagara Falls",0,{"$f":"IF(T170=1,COUNTIF($T$3:T170,1),\"\")","v":""},{"$f":"IFERROR(INDEX($S$3:$S$281,MATCH(ROWS($U$3:U170),$U$3:$U$281,0)),\"\")","v":""},{"$f":"IFERROR(INDEX($S$3:$S$281,MATCH(ROWS($U$3:V170),$U$3:$U$281,0)),\"\")","v":""},{"$f":"IFERROR(INDEX($S$3:$S$281,MATCH(ROWS($U$3:U170),$U$3:$U$281,0)),\"\")","v":""},null,{"$f":"$V$3:INDEX($V$3:$V$281,MAX($U$3:$U$281),1)","v":"Saltspring Island"}]
[null,null,null,null,null,null,null,null,null,null,null,null,null,null,null,null,null,null,"Nipawin",0,{"$f":"IF(T171=1,COUNTIF($T$3:T171,1),\"\")","v":""},{"$f":"IFERROR(INDEX($S$3:$S$281,MATCH(ROWS($U$3:U171),$U$3:$U$281,0)),\"\")","v":""},{"$f":"IFERROR(INDEX($S$3:$S$281,MATCH(ROWS($U$3:V171),$U$3:$U$281,0)),\"\")","v":""},{"$f":"IFERROR(INDEX($S$3:$S$281,MATCH(ROWS($U$3:U171),$U$3:$U$281,0)),\"\")","v":""},null,{"$f":"$V$3:INDEX($V$3:$V$281,MAX($U$3:$U$281),1)","v":"Saltspring Island"}]
[null,null,null,null,null,null,null,null,null,null,null,null,null,null,null,null,null,null,"North Battleford",0,{"$f":"IF(T172=1,COUNTIF($T$3:T172,1),\"\")","v":""},{"$f":"IFERROR(INDEX($S$3:$S$281,MATCH(ROWS($U$3:U172),$U$3:$U$281,0)),\"\")","v":""},{"$f":"IFERROR(INDEX($S$3:$S$281,MATCH(ROWS($U$3:V172),$U$3:$U$281,0)),\"\")","v":""},{"$f":"IFERROR(INDEX($S$3:$S$281,MATCH(ROWS($U$3:U172),$U$3:$U$281,0)),\"\")","v":""},null,{"$f":"$V$3:INDEX($V$3:$V$281,MAX($U$3:$U$281),1)","v":"Saltspring Island"}]
[null,null,null,null,null,null,null,null,null,null,null,null,null,null,null,null,null,null,"North Bay",0,{"$f":"IF(T173=1,COUNTIF($T$3:T173,1),\"\")","v":""},{"$f":"IFERROR(INDEX($S$3:$S$281,MATCH(ROWS($U$3:U173),$U$3:$U$281,0)),\"\")","v":""},{"$f":"IFERROR(INDEX($S$3:$S$281,MATCH(ROWS($U$3:V173),$U$3:$U$281,0)),\"\")","v":""},{"$f":"IFERROR(INDEX($S$3:$S$281,MATCH(ROWS($U$3:U173),$U$3:$U$281,0)),\"\")","v":""},null,{"$f":"$V$3:INDEX($V$3:$V$281,MAX($U$3:$U$281),1)","v":"Saltspring Island"}]
[null,null,null,null,null,null,null,null,null,null,null,null,null,null,null,null,null,null,"North Vancouver, Capilano",0,{"$f":"IF(T174=1,COUNTIF($T$3:T174,1),\"\")","v":""},{"$f":"IFERROR(INDEX($S$3:$S$281,MATCH(ROWS($U$3:U174),$U$3:$U$281,0)),\"\")","v":""},{"$f":"IFERROR(INDEX($S$3:$S$281,MATCH(ROWS($U$3:V174),$U$3:$U$281,0)),\"\")","v":""},{"$f":"IFERROR(INDEX($S$3:$S$281,MATCH(ROWS($U$3:U174),$U$3:$U$281,0)),\"\")","v":""},null,{"$f":"$V$3:INDEX($V$3:$V$281,MAX($U$3:$U$281),1)","v":"Saltspring Island"}]
[null,null,null,null,null,null,null,null,null,null,null,null,null,null,null,null,null,null,"Norway House",0,{"$f":"IF(T175=1,COUNTIF($T$3:T175,1),\"\")","v":""},{"$f":"IFERROR(INDEX($S$3:$S$281,MATCH(ROWS($U$3:U175),$U$3:$U$281,0)),\"\")","v":""},{"$f":"IFERROR(INDEX($S$3:$S$281,MATCH(ROWS($U$3:V175),$U$3:$U$281,0)),\"\")","v":""},{"$f":"IFERROR(INDEX($S$3:$S$281,MATCH(ROWS($U$3:U175),$U$3:$U$281,0)),\"\")","v":""},null,{"$f":"$V$3:INDEX($V$3:$V$281,MAX($U$3:$U$281),1)","v":"Saltspring Island"}]
[null,null,null,null,null,null,null,null,null,null,null,null,null,null,null,null,null,null,"O'Leary",0,{"$f":"IF(T176=1,COUNTIF($T$3:T176,1),\"\")","v":""},{"$f":"IFERROR(INDEX($S$3:$S$281,MATCH(ROWS($U$3:U176),$U$3:$U$281,0)),\"\")","v":""},{"$f":"IFERROR(INDEX($S$3:$S$281,MATCH(ROWS($U$3:V176),$U$3:$U$281,0)),\"\")","v":""},{"$f":"IFERROR(INDEX($S$3:$S$281,MATCH(ROWS($U$3:U176),$U$3:$U$281,0)),\"\")","v":""},null,{"$f":"$V$3:INDEX($V$3:$V$281,MAX($U$3:$U$281),1)","v":"Saltspring Island"}]
[null,null,null,null,null,null,null,null,null,null,null,null,null,null,null,null,null,null,"Oshawa",0,{"$f":"IF(T177=1,COUNTIF($T$3:T177,1),\"\")","v":""},{"$f":"IFERROR(INDEX($S$3:$S$281,MATCH(ROWS($U$3:U177),$U$3:$U$281,0)),\"\")","v":""},{"$f":"IFERROR(INDEX($S$3:$S$281,MATCH(ROWS($U$3:V177),$U$3:$U$281,0)),\"\")","v":""},{"$f":"IFERROR(INDEX($S$3:$S$281,MATCH(ROWS($U$3:U177),$U$3:$U$281,0)),\"\")","v":""},null,{"$f":"$V$3:INDEX($V$3:$V$281,MAX($U$3:$U$281),1)","v":"Saltspring Island"}]
[null,null,null,null,null,null,null,null,null,null,null,null,null,null,null,null,null,null,"Ottawa",0,{"$f":"IF(T178=1,COUNTIF($T$3:T178,1),\"\")","v":""},{"$f":"IFERROR(INDEX($S$3:$S$281,MATCH(ROWS($U$3:U178),$U$3:$U$281,0)),\"\")","v":""},{"$f":"IFERROR(INDEX($S$3:$S$281,MATCH(ROWS($U$3:V178),$U$3:$U$281,0)),\"\")","v":""},{"$f":"IFERROR(INDEX($S$3:$S$281,MATCH(ROWS($U$3:U178),$U$3:$U$281,0)),\"\")","v":""},null,{"$f":"$V$3:INDEX($V$3:$V$281,MAX($U$3:$U$281),1)","v":"Saltspring Island"}]
[null,null,null,null,null,null,null,null,null,null,null,null,null,null,null,null,null,null,"Owen Sound",0,{"$f":"IF(T179=1,COUNTIF($T$3:T179,1),\"\")","v":""},{"$f":"IFERROR(INDEX($S$3:$S$281,MATCH(ROWS($U$3:U179),$U$3:$U$281,0)),\"\")","v":""},{"$f":"IFERROR(INDEX($S$3:$S$281,MATCH(ROWS($U$3:V179),$U$3:$U$281,0)),\"\")","v":""},{"$f":"IFERROR(INDEX($S$3:$S$281,MATCH(ROWS($U$3:U179),$U$3:$U$281,0)),\"\")","v":""},null,{"$f":"$V$3:INDEX($V$3:$V$281,MAX($U$3:$U$281),1)","v":"Saltspring Island"}]
[null,null,null,null,null,null,null,null,null,null,null,null,null,null,null,null,null,null,"Parrsboro",0,{"$f":"IF(T180=1,COUNTIF($T$3:T180,1),\"\")","v":""},{"$f":"IFERROR(INDEX($S$3:$S$281,MATCH(ROWS($U$3:U180),$U$3:$U$281,0)),\"\")","v":""},{"$f":"IFERROR(INDEX($S$3:$S$281,MATCH(ROWS($U$3:V180),$U$3:$U$281,0)),\"\")","v":""},{"$f":"IFERROR(INDEX($S$3:$S$281,MATCH(ROWS($U$3:U180),$U$3:$U$281,0)),\"\")","v":""},null,{"$f":"$V$3:INDEX($V$3:$V$281,MAX($U$3:$U$281),1)","v":"Saltspring Island"}]
[null,null,null,null,null,null,null,null,null,null,null,null,null,null,null,null,null,null,"Pembroke",0,{"$f":"IF(T181=1,COUNTIF($T$3:T181,1),\"\")","v":""},{"$f":"IFERROR(INDEX($S$3:$S$281,MATCH(ROWS($U$3:U181),$U$3:$U$281,0)),\"\")","v":""},{"$f":"IFERROR(INDEX($S$3:$S$281,MATCH(ROWS($U$3:V181),$U$3:$U$281,0)),\"\")","v":""},{"$f":"IFERROR(INDEX($S$3:$S$281,MATCH(ROWS($U$3:U181),$U$3:$U$281,0)),\"\")","v":""},null,{"$f":"$V$3:INDEX($V$3:$V$281,MAX($U$3:$U$281),1)","v":"Saltspring Island"}]
[null,null,null,null,null,null,null,null,null,null,null,null,null,null,null,null,null,null,"Penticton",0,{"$f":"IF(T182=1,COUNTIF($T$3:T182,1),\"\")","v":""},{"$f":"IFERROR(INDEX($S$3:$S$281,MATCH(ROWS($U$3:U182),$U$3:$U$281,0)),\"\")","v":""},{"$f":"IFERROR(INDEX($S$3:$S$281,MATCH(ROWS($U$3:V182),$U$3:$U$281,0)),\"\")","v":""},{"$f":"IFERROR(INDEX($S$3:$S$281,MATCH(ROWS($U$3:U182),$U$3:$U$281,0)),\"\")","v":""},null,{"$f":"$V$3:INDEX($V$3:$V$281,MAX($U$3:$U$281),1)","v":"Saltspring Island"}]
[null,null,null,null,null,null,null,null,null,null,null,null,null,null,null,null,null,null,"Peterborough",0,{"$f":"IF(T183=1,COUNTIF($T$3:T183,1),\"\")","v":""},{"$f":"IFERROR(INDEX($S$3:$S$281,MATCH(ROWS($U$3:U183),$U$3:$U$281,0)),\"\")","v":""},{"$f":"IFERROR(INDEX($S$3:$S$281,MATCH(ROWS($U$3:V183),$U$3:$U$281,0)),\"\")","v":""},{"$f":"IFERROR(INDEX($S$3:$S$281,MATCH(ROWS($U$3:U183),$U$3:$U$281,0)),\"\")","v":""},null,{"$f":"$V$3:INDEX($V$3:$V$281,MAX($U$3:$U$281),1)","v":"Saltspring Island"}]
[null,null,null,null,null,null,null,null,null,null,null,null,null,null,null,null,null,null,"Pictou",0,{"$f":"IF(T184=1,COUNTIF($T$3:T184,1),\"\")","v":""},{"$f":"IFERROR(INDEX($S$3:$S$281,MATCH(ROWS($U$3:U184),$U$3:$U$281,0)),\"\")","v":""},{"$f":"IFERROR(INDEX($S$3:$S$281,MATCH(ROWS($U$3:V184),$U$3:$U$281,0)),\"\")","v":""},{"$f":"IFERROR(INDEX($S$3:$S$281,MATCH(ROWS($U$3:U184),$U$3:$U$281,0)),\"\")","v":""},null,{"$f":"$V$3:INDEX($V$3:$V$281,MAX($U$3:$U$281),1)","v":"Saltspring Island"}]
[null,null,null,null,null,null,null,null,null,null,null,null,null,null,null,null,null,null,"Point Pelee National Park",0,{"$f":"IF(T185=1,COUNTIF($T$3:T185,1),\"\")","v":""},{"$f":"IFERROR(INDEX($S$3:$S$281,MATCH(ROWS($U$3:U185),$U$3:$U$281,0)),\"\")","v":""},{"$f":"IFERROR(INDEX($S$3:$S$281,MATCH(ROWS($U$3:V185),$U$3:$U$281,0)),\"\")","v":""},{"$f":"IFERROR(INDEX($S$3:$S$281,MATCH(ROWS($U$3:U185),$U$3:$U$281,0)),\"\")","v":""},null,{"$f":"$V$3:INDEX($V$3:$V$281,MAX($U$3:$U$281),1)","v":"Saltspring Island"}]
[null,null,null,null,null,null,null,null,null,null,null,null,null,null,null,null,null,null,"Port Alberni",0,{"$f":"IF(T186=1,COUNTIF($T$3:T186,1),\"\")","v":""},{"$f":"IFERROR(INDEX($S$3:$S$281,MATCH(ROWS($U$3:U186),$U$3:$U$281,0)),\"\")","v":""},{"$f":"IFERROR(INDEX($S$3:$S$281,MATCH(ROWS($U$3:V186),$U$3:$U$281,0)),\"\")","v":""},{"$f":"IFERROR(INDEX($S$3:$S$281,MATCH(ROWS($U$3:U186),$U$3:$U$281,0)),\"\")","v":""},null,{"$f":"$V$3:INDEX($V$3:$V$281,MAX($U$3:$U$281),1)","v":"Saltspring Island"}]
[null,null,null,null,null,null,null,null,null,null,null,null,null,null,null,null,null,null,"Port Hardy",0,{"$f":"IF(T187=1,COUNTIF($T$3:T187,1),\"\")","v":""},{"$f":"IFERROR(INDEX($S$3:$S$281,MATCH(ROWS($U$3:U187),$U$3:$U$281,0)),\"\")","v":""},{"$f":"IFERROR(INDEX($S$3:$S$281,MATCH(ROWS($U$3:V187),$U$3:$U$281,0)),\"\")","v":""},{"$f":"IFERROR(INDEX($S$3:$S$281,MATCH(ROWS($U$3:U187),$U$3:$U$281,0)),\"\")","v":""},null,{"$f":"$V$3:INDEX($V$3:$V$281,MAX($U$3:$U$281),1)","v":"Saltspring Island"}]
[null,null,null,null,null,null,null,null,null,null,null,null,null,null,null,null,null,null,"Port Hawkesbury",0,{"$f":"IF(T188=1,COUNTIF($T$3:T188,1),\"\")","v":""},{"$f":"IFERROR(INDEX($S$3:$S$281,MATCH(ROWS($U$3:U188),$U$3:$U$281,0)),\"\")","v":""},{"$f":"IFERROR(INDEX($S$3:$S$281,MATCH(ROWS($U$3:V188),$U$3:$U$281,0)),\"\")","v":""},{"$f":"IFERROR(INDEX($S$3:$S$281,MATCH(ROWS($U$3:U188),$U$3:$U$281,0)),\"\")","v":""},null,{"$f":"$V$3:INDEX($V$3:$V$281,MAX($U$3:$U$281),1)","v":"Saltspring Island"}]
[null,null,null,null,null,null,null,null,null,null,null,null,null,null,null,null,null,null,"Port Renfrew",0,{"$f":"IF(T189=1,COUNTIF($T$3:T189,1),\"\")","v":""},{"$f":"IFERROR(INDEX($S$3:$S$281,MATCH(ROWS($U$3:U189),$U$3:$U$281,0)),\"\")","v":""},{"$f":"IFERROR(INDEX($S$3:$S$281,MATCH(ROWS($U$3:V189),$U$3:$U$281,0)),\"\")","v":""},{"$f":"IFERROR(INDEX($S$3:$S$281,MATCH(ROWS($U$3:U189),$U$3:$U$281,0)),\"\")","v":""},null,{"$f":"$V$3:INDEX($V$3:$V$281,MAX($U$3:$U$281),1)","v":"Saltspring Island"}]
[null,null,null,null,null,null,null,null,null,null,null,null,null,null,null,null,null,null,"Port Saunders",0,{"$f":"IF(T190=1,COUNTIF($T$3:T190,1),\"\")","v":""},{"$f":"IFERROR(INDEX($S$3:$S$281,MATCH(ROWS($U$3:U190),$U$3:$U$281,0)),\"\")","v":""},{"$f":"IFERROR(INDEX($S$3:$S$281,MATCH(ROWS($U$3:V190),$U$3:$U$281,0)),\"\")","v":""},{"$f":"IFERROR(INDEX($S$3:$S$281,MATCH(ROWS($U$3:U190),$U$3:$U$281,0)),\"\")","v":""},null,{"$f":"$V$3:INDEX($V$3:$V$281,MAX($U$3:$U$281),1)","v":"Saltspring Island"}]
[null,null,null,null,null,null,null,null,null,null,null,null,null,null,null,null,null,null,"Portage La Prairie",0,{"$f":"IF(T191=1,COUNTIF($T$3:T191,1),\"\")","v":""},{"$f":"IFERROR(INDEX($S$3:$S$281,MATCH(ROWS($U$3:U191),$U$3:$U$281,0)),\"\")","v":""},{"$f":"IFERROR(INDEX($S$3:$S$281,MATCH(ROWS($U$3:V191),$U$3:$U$281,0)),\"\")","v":""},{"$f":"IFERROR(INDEX($S$3:$S$281,MATCH(ROWS($U$3:U191),$U$3:$U$281,0)),\"\")","v":""},null,{"$f":"$V$3:INDEX($V$3:$V$281,MAX($U$3:$U$281),1)","v":"Saltspring Island"}]
[null,null,null,null,null,null,null,null,null,null,null,null,null,null,null,null,null,null,"Powell River",0,{"$f":"IF(T192=1,COUNTIF($T$3:T192,1),\"\")","v":""},{"$f":"IFERROR(INDEX($S$3:$S$281,MATCH(ROWS($U$3:U192),$U$3:$U$281,0)),\"\")","v":""},{"$f":"IFERROR(INDEX($S$3:$S$281,MATCH(ROWS($U$3:V192),$U$3:$U$281,0)),\"\")","v":""},{"$f":"IFERROR(INDEX($S$3:$S$281,MATCH(ROWS($U$3:U192),$U$3:$U$281,0)),\"\")","v":""},null,{"$f":"$V$3:INDEX($V$3:$V$281,MAX($U$3:$U$281),1)","v":"Saltspring Island"}]
[null,null,null,null,null,null,null,null,null,null,null,null,null,null,null,null,null,null,"Prince Albert",0,{"$f":"IF(T193=1,COUNTIF($T$3:T193,1),\"\")","v":""},{"$f":"IFERROR(INDEX($S$3:$S$281,MATCH(ROWS($U$3:U193),$U$3:$U$281,0)),\"\")","v":""},{"$f":"IFERROR(INDEX($S$3:$S$281,MATCH(ROWS($U$3:V193),$U$3:$U$281,0)),\"\")","v":""},{"$f":"IFERROR(INDEX($S$3:$S$281,MATCH(ROWS($U$3:U193),$U$3:$U$281,0)),\"\")","v":""},null,{"$f":"$V$3:INDEX($V$3:$V$281,MAX($U$3:$U$281),1)","v":"Saltspring Island"}]
[null,null,null,null,null,null,null,null,null,null,null,null,null,null,null,null,null,null,"Prince George",0,{"$f":"IF(T194=1,COUNTIF($T$3:T194,1),\"\")","v":""},{"$f":"IFERROR(INDEX($S$3:$S$281,MATCH(ROWS($U$3:U194),$U$3:$U$281,0)),\"\")","v":""},{"$f":"IFERROR(INDEX($S$3:$S$281,MATCH(ROWS($U$3:V194),$U$3:$U$281,0)),\"\")","v":""},{"$f":"IFERROR(INDEX($S$3:$S$281,MATCH(ROWS($U$3:U194),$U$3:$U$281,0)),\"\")","v":""},null,{"$f":"$V$3:INDEX($V$3:$V$281,MAX($U$3:$U$281),1)","v":"Saltspring Island"}]
[null,null,null,null,null,null,null,null,null,null,null,null,null,null,null,null,null,null,"Prince Rupert",0,{"$f":"IF(T195=1,COUNTIF($T$3:T195,1),\"\")","v":""},{"$f":"IFERROR(INDEX($S$3:$S$281,MATCH(ROWS($U$3:U195),$U$3:$U$281,0)),\"\")","v":""},{"$f":"IFERROR(INDEX($S$3:$S$281,MATCH(ROWS($U$3:V195),$U$3:$U$281,0)),\"\")","v":""},{"$f":"IFERROR(INDEX($S$3:$S$281,MATCH(ROWS($U$3:U195),$U$3:$U$281,0)),\"\")","v":""},null,{"$f":"$V$3:INDEX($V$3:$V$281,MAX($U$3:$U$281),1)","v":"Saltspring Island"}]
[null,null,null,null,null,null,null,null,null,null,null,null,null,null,null,null,null,null,"Pugwash",0,{"$f":"IF(T196=1,COUNTIF($T$3:T196,1),\"\")","v":""},{"$f":"IFERROR(INDEX($S$3:$S$281,MATCH(ROWS($U$3:U196),$U$3:$U$281,0)),\"\")","v":""},{"$f":"IFERROR(INDEX($S$3:$S$281,MATCH(ROWS($U$3:V196),$U$3:$U$281,0)),\"\")","v":""},{"$f":"IFERROR(INDEX($S$3:$S$281,MATCH(ROWS($U$3:U196),$U$3:$U$281,0)),\"\")","v":""},null,{"$f":"$V$3:INDEX($V$3:$V$281,MAX($U$3:$U$281),1)","v":"Saltspring Island"}]
[null,null,null,null,null,null,null,null,null,null,null,null,null,null,null,null,null,null,"Qu'Appelle Valley",0,{"$f":"IF(T197=1,COUNTIF($T$3:T197,1),\"\")","v":""},{"$f":"IFERROR(INDEX($S$3:$S$281,MATCH(ROWS($U$3:U197),$U$3:$U$281,0)),\"\")","v":""},{"$f":"IFERROR(INDEX($S$3:$S$281,MATCH(ROWS($U$3:V197),$U$3:$U$281,0)),\"\")","v":""},{"$f":"IFERROR(INDEX($S$3:$S$281,MATCH(ROWS($U$3:U197),$U$3:$U$281,0)),\"\")","v":""},null,{"$f":"$V$3:INDEX($V$3:$V$281,MAX($U$3:$U$281),1)","v":"Saltspring Island"}]
[null,null,null,null,null,null,null,null,null,null,null,null,null,null,null,null,null,null,"Québec City",0,{"$f":"IF(T198=1,COUNTIF($T$3:T198,1),\"\")","v":""},{"$f":"IFERROR(INDEX($S$3:$S$281,MATCH(ROWS($U$3:U198),$U$3:$U$281,0)),\"\")","v":""},{"$f":"IFERROR(INDEX($S$3:$S$281,MATCH(ROWS($U$3:V198),$U$3:$U$281,0)),\"\")","v":""},{"$f":"IFERROR(INDEX($S$3:$S$281,MATCH(ROWS($U$3:U198),$U$3:$U$281,0)),\"\")","v":""},null,{"$f":"$V$3:INDEX($V$3:$V$281,MAX($U$3:$U$281),1)","v":"Saltspring Island"}]
[null,null,null,null,null,null,null,null,null,null,null,null,null,null,null,null,null,null,"Radisson",0,{"$f":"IF(T199=1,COUNTIF($T$3:T199,1),\"\")","v":""},{"$f":"IFERROR(INDEX($S$3:$S$281,MATCH(ROWS($U$3:U199),$U$3:$U$281,0)),\"\")","v":""},{"$f":"IFERROR(INDEX($S$3:$S$281,MATCH(ROWS($U$3:V199),$U$3:$U$281,0)),\"\")","v":""},{"$f":"IFERROR(INDEX($S$3:$S$281,MATCH(ROWS($U$3:U199),$U$3:$U$281,0)),\"\")","v":""},null,{"$f":"$V$3:INDEX($V$3:$V$281,MAX($U$3:$U$281),1)","v":"Saltspring Island"}]
[null,null,null,null,null,null,null,null,null,null,null,null,null,null,null,null,null,null,"Red Deer",0,{"$f":"IF(T200=1,COUNTIF($T$3:T200,1),\"\")","v":""},{"$f":"IFERROR(INDEX($S$3:$S$281,MATCH(ROWS($U$3:U200),$U$3:$U$281,0)),\"\")","v":""},{"$f":"IFERROR(INDEX($S$3:$S$281,MATCH(ROWS($U$3:V200),$U$3:$U$281,0)),\"\")","v":""},{"$f":"IFERROR(INDEX($S$3:$S$281,MATCH(ROWS($U$3:U200),$U$3:$U$281,0)),\"\")","v":""},null,{"$f":"$V$3:INDEX($V$3:$V$281,MAX($U$3:$U$281),1)","v":"Saltspring Island"}]
[null,null,null,null,null,null,null,null,null,null,null,null,null,null,null,null,null,null,"Red Lake",0,{"$f":"IF(T201=1,COUNTIF($T$3:T201,1),\"\")","v":""},{"$f":"IFERROR(INDEX($S$3:$S$281,MATCH(ROWS($U$3:U201),$U$3:$U$281,0)),\"\")","v":""},{"$f":"IFERROR(INDEX($S$3:$S$281,MATCH(ROWS($U$3:V201),$U$3:$U$281,0)),\"\")","v":""},{"$f":"IFERROR(INDEX($S$3:$S$281,MATCH(ROWS($U$3:U201),$U$3:$U$281,0)),\"\")","v":""},null,{"$f":"$V$3:INDEX($V$3:$V$281,MAX($U$3:$U$281),1)","v":"Saltspring Island"}]
[null,null,null,null,null,null,null,null,null,null,null,null,null,null,null,null,null,null,"Regina",0,{"$f":"IF(T202=1,COUNTIF($T$3:T202,1),\"\")","v":""},{"$f":"IFERROR(INDEX($S$3:$S$281,MATCH(ROWS($U$3:U202),$U$3:$U$281,0)),\"\")","v":""},{"$f":"IFERROR(INDEX($S$3:$S$281,MATCH(ROWS($U$3:V202),$U$3:$U$281,0)),\"\")","v":""},{"$f":"IFERROR(INDEX($S$3:$S$281,MATCH(ROWS($U$3:U202),$U$3:$U$281,0)),\"\")","v":""},null,{"$f":"$V$3:INDEX($V$3:$V$281,MAX($U$3:$U$281),1)","v":"Saltspring Island"}]
[null,null,null,null,null,null,null,null,null,null,null,null,null,null,null,null,null,null,"Revelstoke",0,{"$f":"IF(T203=1,COUNTIF($T$3:T203,1),\"\")","v":""},{"$f":"IFERROR(INDEX($S$3:$S$281,MATCH(ROWS($U$3:U203),$U$3:$U$281,0)),\"\")","v":""},{"$f":"IFERROR(INDEX($S$3:$S$281,MATCH(ROWS($U$3:V203),$U$3:$U$281,0)),\"\")","v":""},{"$f":"IFERROR(INDEX($S$3:$S$281,MATCH(ROWS($U$3:U203),$U$3:$U$281,0)),\"\")","v":""},null,{"$f":"$V$3:INDEX($V$3:$V$281,MAX($U$3:$U$281),1)","v":"Saltspring Island"}]
[null,null,null,null,null,null,null,null,null,null,null,null,null,null,null,null,null,null,"Rimouski",0,{"$f":"IF(T204=1,COUNTIF($T$3:T204,1),\"\")","v":""},{"$f":"IFERROR(INDEX($S$3:$S$281,MATCH(ROWS($U$3:U204),$U$3:$U$281,0)),\"\")","v":""},{"$f":"IFERROR(INDEX($S$3:$S$281,MATCH(ROWS($U$3:V204),$U$3:$U$281,0)),\"\")","v":""},{"$f":"IFERROR(INDEX($S$3:$S$281,MATCH(ROWS($U$3:U204),$U$3:$U$281,0)),\"\")","v":""},null,{"$f":"$V$3:INDEX($V$3:$V$281,MAX($U$3:$U$281),1)","v":"Saltspring Island"}]
[null,null,null,null,null,null,null,null,null,null,null,null,null,null,null,null,null,null,"Roberval",0,{"$f":"IF(T205=1,COUNTIF($T$3:T205,1),\"\")","v":""},{"$f":"IFERROR(INDEX($S$3:$S$281,MATCH(ROWS($U$3:U205),$U$3:$U$281,0)),\"\")","v":""},{"$f":"IFERROR(INDEX($S$3:$S$281,MATCH(ROWS($U$3:V205),$U$3:$U$281,0)),\"\")","v":""},{"$f":"IFERROR(INDEX($S$3:$S$281,MATCH(ROWS($U$3:U205),$U$3:$U$281,0)),\"\")","v":""},null,{"$f":"$V$3:INDEX($V$3:$V$281,MAX($U$3:$U$281),1)","v":"Saltspring Island"}]
[null,null,null,null,null,null,null,null,null,null,null,null,null,null,null,null,null,null,"Rocky Harbour",0,{"$f":"IF(T206=1,COUNTIF($T$3:T206,1),\"\")","v":""},{"$f":"IFERROR(INDEX($S$3:$S$281,MATCH(ROWS($U$3:U206),$U$3:$U$281,0)),\"\")","v":""},{"$f":"IFERROR(INDEX($S$3:$S$281,MATCH(ROWS($U$3:V206),$U$3:$U$281,0)),\"\")","v":""},{"$f":"IFERROR(INDEX($S$3:$S$281,MATCH(ROWS($U$3:U206),$U$3:$U$281,0)),\"\")","v":""},null,{"$f":"$V$3:INDEX($V$3:$V$281,MAX($U$3:$U$281),1)","v":"Saltspring Island"}]
[null,null,null,null,null,null,null,null,null,null,null,null,null,null,null,null,null,null,"Rocky Mountain House",{"$f":"--ISNUMBER(IFERROR(SEARCH($K$2,S207,1),\"\"))","v":0},{"$f":"IF(T207=1,COUNTIF($T$3:T207,1),\"\")","v":""},{"$f":"IFERROR(INDEX($S$3:$S$281,MATCH(ROWS($U$3:U207),$U$3:$U$281,0)),\"\")","v":""},{"$f":"IFERROR(INDEX($S$3:$S$281,MATCH(ROWS($U$3:V207),$U$3:$U$281,0)),\"\")","v":""},{"$f":"IFERROR(INDEX($S$3:$S$281,MATCH(ROWS($U$3:U207),$U$3:$U$281,0)),\"\")","v":""},null,{"$f":"$V$3:INDEX($V$3:$V$281,MAX($U$3:$U$281),1)","v":"Saltspring Island"}]
[null,null,null,null,null,null,null,null,null,null,null,null,null,null,null,null,null,null,"Sable Island",0,{"$f":"IF(T208=1,COUNTIF($T$3:T208,1),\"\")","v":""},{"$f":"IFERROR(INDEX($S$3:$S$281,MATCH(ROWS($U$3:U208),$U$3:$U$281,0)),\"\")","v":""},{"$f":"IFERROR(INDEX($S$3:$S$281,MATCH(ROWS($U$3:V208),$U$3:$U$281,0)),\"\")","v":""},{"$f":"IFERROR(INDEX($S$3:$S$281,MATCH(ROWS($U$3:U208),$U$3:$U$281,0)),\"\")","v":""},null,{"$f":"$V$3:INDEX($V$3:$V$281,MAX($U$3:$U$281),1)","v":"Saltspring Island"}]
[null,null,null,null,null,null,null,null,null,null,null,null,null,null,null,null,null,null,"Sackville",0,{"$f":"IF(T209=1,COUNTIF($T$3:T209,1),\"\")","v":""},{"$f":"IFERROR(INDEX($S$3:$S$281,MATCH(ROWS($U$3:U209),$U$3:$U$281,0)),\"\")","v":""},{"$f":"IFERROR(INDEX($S$3:$S$281,MATCH(ROWS($U$3:V209),$U$3:$U$281,0)),\"\")","v":""},{"$f":"IFERROR(INDEX($S$3:$S$281,MATCH(ROWS($U$3:U209),$U$3:$U$281,0)),\"\")","v":""},null,{"$f":"$V$3:INDEX($V$3:$V$281,MAX($U$3:$U$281),1)","v":"Saltspring Island"}]
[null,null,null,null,null,null,null,null,null,null,null,null,null,null,null,null,null,null,"Saguenay",0,{"$f":"IF(T210=1,COUNTIF($T$3:T210,1),\"\")","v":""},{"$f":"IFERROR(INDEX($S$3:$S$281,MATCH(ROWS($U$3:U210),$U$3:$U$281,0)),\"\")","v":""},{"$f":"IFERROR(INDEX($S$3:$S$281,MATCH(ROWS($U$3:V210),$U$3:$U$281,0)),\"\")","v":""},{"$f":"IFERROR(INDEX($S$3:$S$281,MATCH(ROWS($U$3:U210),$U$3:$U$281,0)),\"\")","v":""},null,{"$f":"$V$3:INDEX($V$3:$V$281,MAX($U$3:$U$281),1)","v":"Saltspring Island"}]
[null,null,null,null,null,null,null,null,null,null,null,null,null,null,null,null,null,null,"Saint John",0,{"$f":"IF(T211=1,COUNTIF($T$3:T211,1),\"\")","v":""},{"$f":"IFERROR(INDEX($S$3:$S$281,MATCH(ROWS($U$3:U211),$U$3:$U$281,0)),\"\")","v":""},{"$f":"IFERROR(INDEX($S$3:$S$281,MATCH(ROWS($U$3:V211),$U$3:$U$281,0)),\"\")","v":""},{"$f":"IFERROR(INDEX($S$3:$S$281,MATCH(ROWS($U$3:U211),$U$3:$U$281,0)),\"\")","v":""},null,{"$f":"$V$3:INDEX($V$3:$V$281,MAX($U$3:$U$281),1)","v":"Saltspring Island"}]
[null,null,null,null,null,null,null,null,null,null,null,null,null,null,null,null,null,null,"Saint Leonard",0,{"$f":"IF(T212=1,COUNTIF($T$3:T212,1),\"\")","v":""},{"$f":"IFERROR(INDEX($S$3:$S$281,MATCH(ROWS($U$3:U212),$U$3:$U$281,0)),\"\")","v":""},{"$f":"IFERROR(INDEX($S$3:$S$281,MATCH(ROWS($U$3:V212),$U$3:$U$281,0)),\"\")","v":""},{"$f":"IFERROR(INDEX($S$3:$S$281,MATCH(ROWS($U$3:U212),$U$3:$U$281,0)),\"\")","v":""},null,{"$f":"$V$3:INDEX($V$3:$V$281,MAX($U$3:$U$281),1)","v":"Saltspring Island"}]
[null,null,null,null,null,null,null,null,null,null,null,null,null,null,null,null,null,null,"Saltspring Island",1,{"$f":"IF(T213=1,COUNTIF($T$3:T213,1),\"\")","v":1},{"$f":"IFERROR(INDEX($S$3:$S$281,MATCH(ROWS($U$3:U213),$U$3:$U$281,0)),\"\")","v":""},{"$f":"IFERROR(INDEX($S$3:$S$281,MATCH(ROWS($U$3:V213),$U$3:$U$281,0)),\"\")","v":""},{"$f":"IFERROR(INDEX($S$3:$S$281,MATCH(ROWS($U$3:U213),$U$3:$U$281,0)),\"\")","v":""},null,{"$f":"$V$3:INDEX($V$3:$V$281,MAX($U$3:$U$281),1)","v":"Saltspring Island"}]
[null,null,null,null,null,null,null,null,null,null,null,null,null,null,null,null,null,null,"Sandspit, Haida Gwaii",0,{"$f":"IF(T214=1,COUNTIF($T$3:T214,1),\"\")","v":""},{"$f":"IFERROR(INDEX($S$3:$S$281,MATCH(ROWS($U$3:U214),$U$3:$U$281,0)),\"\")","v":""},{"$f":"IFERROR(INDEX($S$3:$S$281,MATCH(ROWS($U$3:V214),$U$3:$U$281,0)),\"\")","v":""},{"$f":"IFERROR(INDEX($S$3:$S$281,MATCH(ROWS($U$3:U214),$U$3:$U$281,0)),\"\")","v":""},null,{"$f":"$V$3:INDEX($V$3:$V$281,MAX($U$3:$U$281),1)","v":"Saltspring Island"}]
[null,null,null,null,null,null,null,null,null,null,null,null,null,null,null,null,null,null,"Sarnia",0,{"$f":"IF(T215=1,COUNTIF($T$3:T215,1),\"\")","v":""},{"$f":"IFERROR(INDEX($S$3:$S$281,MATCH(ROWS($U$3:U215),$U$3:$U$281,0)),\"\")","v":""},{"$f":"IFERROR(INDEX($S$3:$S$281,MATCH(ROWS($U$3:V215),$U$3:$U$281,0)),\"\")","v":""},{"$f":"IFERROR(INDEX($S$3:$S$281,MATCH(ROWS($U$3:U215),$U$3:$U$281,0)),\"\")","v":""},null,{"$f":"$V$3:INDEX($V$3:$V$281,MAX($U$3:$U$281),1)","v":"Saltspring Island"}]
[null,null,null,null,null,null,null,null,null,null,null,null,null,null,null,null,null,null,"Saskatoon",0,{"$f":"IF(T216=1,COUNTIF($T$3:T216,1),\"\")","v":""},{"$f":"IFERROR(INDEX($S$3:$S$281,MATCH(ROWS($U$3:U216),$U$3:$U$281,0)),\"\")","v":""},{"$f":"IFERROR(INDEX($S$3:$S$281,MATCH(ROWS($U$3:V216),$U$3:$U$281,0)),\"\")","v":""},{"$f":"IFERROR(INDEX($S$3:$S$281,MATCH(ROWS($U$3:U216),$U$3:$U$281,0)),\"\")","v":""},null,{"$f":"$V$3:INDEX($V$3:$V$281,MAX($U$3:$U$281),1)","v":"Saltspring Island"}]
[null,null,null,null,null,null,null,null,null,null,null,null,null,null,null,null,null,null,"Sault Ste Marie",0,{"$f":"IF(T217=1,COUNTIF($T$3:T217,1),\"\")","v":""},{"$f":"IFERROR(INDEX($S$3:$S$281,MATCH(ROWS($U$3:U217),$U$3:$U$281,0)),\"\")","v":""},{"$f":"IFERROR(INDEX($S$3:$S$281,MATCH(ROWS($U$3:V217),$U$3:$U$281,0)),\"\")","v":""},{"$f":"IFERROR(INDEX($S$3:$S$281,MATCH(ROWS($U$3:U217),$U$3:$U$281,0)),\"\")","v":""},null,{"$f":"$V$3:INDEX($V$3:$V$281,MAX($U$3:$U$281),1)","v":"Saltspring Island"}]
[null,null,null,null,null,null,null,null,null,null,null,null,null,null,null,null,null,null,"Schefferville",0,{"$f":"IF(T218=1,COUNTIF($T$3:T218,1),\"\")","v":""},{"$f":"IFERROR(INDEX($S$3:$S$281,MATCH(ROWS($U$3:U218),$U$3:$U$281,0)),\"\")","v":""},{"$f":"IFERROR(INDEX($S$3:$S$281,MATCH(ROWS($U$3:V218),$U$3:$U$281,0)),\"\")","v":""},{"$f":"IFERROR(INDEX($S$3:$S$281,MATCH(ROWS($U$3:U218),$U$3:$U$281,0)),\"\")","v":""},null,{"$f":"$V$3:INDEX($V$3:$V$281,MAX($U$3:$U$281),1)","v":"Saltspring Island"}]
[null,null,null,null,null,null,null,null,null,null,null,null,null,null,null,null,null,null,"Selkirk",0,{"$f":"IF(T219=1,COUNTIF($T$3:T219,1),\"\")","v":""},{"$f":"IFERROR(INDEX($S$3:$S$281,MATCH(ROWS($U$3:U219),$U$3:$U$281,0)),\"\")","v":""},{"$f":"IFERROR(INDEX($S$3:$S$281,MATCH(ROWS($U$3:V219),$U$3:$U$281,0)),\"\")","v":""},{"$f":"IFERROR(INDEX($S$3:$S$281,MATCH(ROWS($U$3:U219),$U$3:$U$281,0)),\"\")","v":""},null,{"$f":"$V$3:INDEX($V$3:$V$281,MAX($U$3:$U$281),1)","v":"Saltspring Island"}]
[null,null,null,null,null,null,null,null,null,null,null,null,null,null,null,null,null,null,"Sept-Iles",0,{"$f":"IF(T220=1,COUNTIF($T$3:T220,1),\"\")","v":""},{"$f":"IFERROR(INDEX($S$3:$S$281,MATCH(ROWS($U$3:U220),$U$3:$U$281,0)),\"\")","v":""},{"$f":"IFERROR(INDEX($S$3:$S$281,MATCH(ROWS($U$3:V220),$U$3:$U$281,0)),\"\")","v":""},{"$f":"IFERROR(INDEX($S$3:$S$281,MATCH(ROWS($U$3:U220),$U$3:$U$281,0)),\"\")","v":""},null,{"$f":"$V$3:INDEX($V$3:$V$281,MAX($U$3:$U$281),1)","v":"Saltspring Island"}]
[null,null,null,null,null,null,null,null,null,null,null,null,null,null,null,null,null,null,"Sherbrooke",0,{"$f":"IF(T221=1,COUNTIF($T$3:T221,1),\"\")","v":""},{"$f":"IFERROR(INDEX($S$3:$S$281,MATCH(ROWS($U$3:U221),$U$3:$U$281,0)),\"\")","v":""},{"$f":"IFERROR(INDEX($S$3:$S$281,MATCH(ROWS($U$3:V221),$U$3:$U$281,0)),\"\")","v":""},{"$f":"IFERROR(INDEX($S$3:$S$281,MATCH(ROWS($U$3:U221),$U$3:$U$281,0)),\"\")","v":""},null,{"$f":"$V$3:INDEX($V$3:$V$281,MAX($U$3:$U$281),1)","v":"Saltspring Island"}]
[null,null,null,null,null,null,null,null,null,null,null,null,null,null,null,null,null,null,"Sidney",0,{"$f":"IF(T222=1,COUNTIF($T$3:T222,1),\"\")","v":""},{"$f":"IFERROR(INDEX($S$3:$S$281,MATCH(ROWS($U$3:U222),$U$3:$U$281,0)),\"\")","v":""},{"$f":"IFERROR(INDEX($S$3:$S$281,MATCH(ROWS($U$3:V222),$U$3:$U$281,0)),\"\")","v":""},{"$f":"IFERROR(INDEX($S$3:$S$281,MATCH(ROWS($U$3:U222),$U$3:$U$281,0)),\"\")","v":""},null,{"$f":"$V$3:INDEX($V$3:$V$281,MAX($U$3:$U$281),1)","v":"Saltspring Island"}]
[null,null,null,null,null,null,null,null,null,null,null,null,null,null,null,null,null,null,"Slave Lake",0,{"$f":"IF(T223=1,COUNTIF($T$3:T223,1),\"\")","v":""},{"$f":"IFERROR(INDEX($S$3:$S$281,MATCH(ROWS($U$3:U223),$U$3:$U$281,0)),\"\")","v":""},{"$f":"IFERROR(INDEX($S$3:$S$281,MATCH(ROWS($U$3:V223),$U$3:$U$281,0)),\"\")","v":""},{"$f":"IFERROR(INDEX($S$3:$S$281,MATCH(ROWS($U$3:U223),$U$3:$U$281,0)),\"\")","v":""},null,{"$f":"$V$3:INDEX($V$3:$V$281,MAX($U$3:$U$281),1)","v":"Saltspring Island"}]
[null,null,null,null,null,null,null,null,null,null,null,null,null,null,null,null,null,null,"Smithers",0,{"$f":"IF(T224=1,COUNTIF($T$3:T224,1),\"\")","v":""},{"$f":"IFERROR(INDEX($S$3:$S$281,MATCH(ROWS($U$3:U224),$U$3:$U$281,0)),\"\")","v":""},{"$f":"IFERROR(INDEX($S$3:$S$281,MATCH(ROWS($U$3:V224),$U$3:$U$281,0)),\"\")","v":""},{"$f":"IFERROR(INDEX($S$3:$S$281,MATCH(ROWS($U$3:U224),$U$3:$U$281,0)),\"\")","v":""},null,{"$f":"$V$3:INDEX($V$3:$V$281,MAX($U$3:$U$281),1)","v":"Saltspring Island"}]
[null,null,null,null,null,null,null,null,null,null,null,null,null,null,null,null,null,null,"Sorel - Tracy",0,{"$f":"IF(T225=1,COUNTIF($T$3:T225,1),\"\")","v":""},{"$f":"IFERROR(INDEX($S$3:$S$281,MATCH(ROWS($U$3:U225),$U$3:$U$281,0)),\"\")","v":""},{"$f":"IFERROR(INDEX($S$3:$S$281,MATCH(ROWS($U$3:V225),$U$3:$U$281,0)),\"\")","v":""},{"$f":"IFERROR(INDEX($S$3:$S$281,MATCH(ROWS($U$3:U225),$U$3:$U$281,0)),\"\")","v":""},null,{"$f":"$V$3:INDEX($V$3:$V$281,MAX($U$3:$U$281),1)","v":"Saltspring Island"}]
[null,null,null,null,null,null,null,null,null,null,null,null,null,null,null,null,null,null,"South Baymouth",0,{"$f":"IF(T226=1,COUNTIF($T$3:T226,1),\"\")","v":""},{"$f":"IFERROR(INDEX($S$3:$S$281,MATCH(ROWS($U$3:U226),$U$3:$U$281,0)),\"\")","v":""},{"$f":"IFERROR(INDEX($S$3:$S$281,MATCH(ROWS($U$3:V226),$U$3:$U$281,0)),\"\")","v":""},{"$f":"IFERROR(INDEX($S$3:$S$281,MATCH(ROWS($U$3:U226),$U$3:$U$281,0)),\"\")","v":""},null,{"$f":"$V$3:INDEX($V$3:$V$281,MAX($U$3:$U$281),1)","v":"Saltspring Island"}]
[null,null,null,null,null,null,null,null,null,null,null,null,null,null,null,null,null,null,"Sparwood",0,{"$f":"IF(T227=1,COUNTIF($T$3:T227,1),\"\")","v":""},{"$f":"IFERROR(INDEX($S$3:$S$281,MATCH(ROWS($U$3:U227),$U$3:$U$281,0)),\"\")","v":""},{"$f":"IFERROR(INDEX($S$3:$S$281,MATCH(ROWS($U$3:V227),$U$3:$U$281,0)),\"\")","v":""},{"$f":"IFERROR(INDEX($S$3:$S$281,MATCH(ROWS($U$3:U227),$U$3:$U$281,0)),\"\")","v":""},null,{"$f":"$V$3:INDEX($V$3:$V$281,MAX($U$3:$U$281),1)","v":"Saltspring Island"}]
[null,null,null,null,null,null,null,null,null,null,null,null,null,null,null,null,null,null,"Springdale",0,{"$f":"IF(T228=1,COUNTIF($T$3:T228,1),\"\")","v":""},{"$f":"IFERROR(INDEX($S$3:$S$281,MATCH(ROWS($U$3:U228),$U$3:$U$281,0)),\"\")","v":""},{"$f":"IFERROR(INDEX($S$3:$S$281,MATCH(ROWS($U$3:V228),$U$3:$U$281,0)),\"\")","v":""},{"$f":"IFERROR(INDEX($S$3:$S$281,MATCH(ROWS($U$3:U228),$U$3:$U$281,0)),\"\")","v":""},null,{"$f":"$V$3:INDEX($V$3:$V$281,MAX($U$3:$U$281),1)","v":"Saltspring Island"}]
[null,null,null,null,null,null,null,null,null,null,null,null,null,null,null,null,null,null,"St Anthony",0,{"$f":"IF(T229=1,COUNTIF($T$3:T229,1),\"\")","v":""},{"$f":"IFERROR(INDEX($S$3:$S$281,MATCH(ROWS($U$3:U229),$U$3:$U$281,0)),\"\")","v":""},{"$f":"IFERROR(INDEX($S$3:$S$281,MATCH(ROWS($U$3:V229),$U$3:$U$281,0)),\"\")","v":""},{"$f":"IFERROR(INDEX($S$3:$S$281,MATCH(ROWS($U$3:U229),$U$3:$U$281,0)),\"\")","v":""},null,{"$f":"$V$3:INDEX($V$3:$V$281,MAX($U$3:$U$281),1)","v":"Saltspring Island"}]
[null,null,null,null,null,null,null,null,null,null,null,null,null,null,null,null,null,null,"St Catharines",0,{"$f":"IF(T230=1,COUNTIF($T$3:T230,1),\"\")","v":""},{"$f":"IFERROR(INDEX($S$3:$S$281,MATCH(ROWS($U$3:U230),$U$3:$U$281,0)),\"\")","v":""},{"$f":"IFERROR(INDEX($S$3:$S$281,MATCH(ROWS($U$3:V230),$U$3:$U$281,0)),\"\")","v":""},{"$f":"IFERROR(INDEX($S$3:$S$281,MATCH(ROWS($U$3:U230),$U$3:$U$281,0)),\"\")","v":""},null,{"$f":"$V$3:INDEX($V$3:$V$281,MAX($U$3:$U$281),1)","v":"Saltspring Island"}]
[null,null,null,null,null,null,null,null,null,null,null,null,null,null,null,null,null,null,"St Donat",0,{"$f":"IF(T231=1,COUNTIF($T$3:T231,1),\"\")","v":""},{"$f":"IFERROR(INDEX($S$3:$S$281,MATCH(ROWS($U$3:U231),$U$3:$U$281,0)),\"\")","v":""},{"$f":"IFERROR(INDEX($S$3:$S$281,MATCH(ROWS($U$3:V231),$U$3:$U$281,0)),\"\")","v":""},{"$f":"IFERROR(INDEX($S$3:$S$281,MATCH(ROWS($U$3:U231),$U$3:$U$281,0)),\"\")","v":""},null,{"$f":"$V$3:INDEX($V$3:$V$281,MAX($U$3:$U$281),1)","v":"Saltspring Island"}]
[null,null,null,null,null,null,null,null,null,null,null,null,null,null,null,null,null,null,"St Hyacinthe",0,{"$f":"IF(T232=1,COUNTIF($T$3:T232,1),\"\")","v":""},{"$f":"IFERROR(INDEX($S$3:$S$281,MATCH(ROWS($U$3:U232),$U$3:$U$281,0)),\"\")","v":""},{"$f":"IFERROR(INDEX($S$3:$S$281,MATCH(ROWS($U$3:V232),$U$3:$U$281,0)),\"\")","v":""},{"$f":"IFERROR(INDEX($S$3:$S$281,MATCH(ROWS($U$3:U232),$U$3:$U$281,0)),\"\")","v":""},null,{"$f":"$V$3:INDEX($V$3:$V$281,MAX($U$3:$U$281),1)","v":"Saltspring Island"}]
[null,null,null,null,null,null,null,null,null,null,null,null,null,null,null,null,null,null,"St Jerome",0,{"$f":"IF(T233=1,COUNTIF($T$3:T233,1),\"\")","v":""},{"$f":"IFERROR(INDEX($S$3:$S$281,MATCH(ROWS($U$3:U233),$U$3:$U$281,0)),\"\")","v":""},{"$f":"IFERROR(INDEX($S$3:$S$281,MATCH(ROWS($U$3:V233),$U$3:$U$281,0)),\"\")","v":""},{"$f":"IFERROR(INDEX($S$3:$S$281,MATCH(ROWS($U$3:U233),$U$3:$U$281,0)),\"\")","v":""},null,{"$f":"$V$3:INDEX($V$3:$V$281,MAX($U$3:$U$281),1)","v":"Saltspring Island"}]
[null,null,null,null,null,null,null,null,null,null,null,null,null,null,null,null,null,null,"St John's",0,{"$f":"IF(T234=1,COUNTIF($T$3:T234,1),\"\")","v":""},{"$f":"IFERROR(INDEX($S$3:$S$281,MATCH(ROWS($U$3:U234),$U$3:$U$281,0)),\"\")","v":""},{"$f":"IFERROR(INDEX($S$3:$S$281,MATCH(ROWS($U$3:V234),$U$3:$U$281,0)),\"\")","v":""},{"$f":"IFERROR(INDEX($S$3:$S$281,MATCH(ROWS($U$3:U234),$U$3:$U$281,0)),\"\")","v":""},null,{"$f":"$V$3:INDEX($V$3:$V$281,MAX($U$3:$U$281),1)","v":"Saltspring Island"}]
[null,null,null,null,null,null,null,null,null,null,null,null,null,null,null,null,null,null,"St Lawrence",0,{"$f":"IF(T235=1,COUNTIF($T$3:T235,1),\"\")","v":""},{"$f":"IFERROR(INDEX($S$3:$S$281,MATCH(ROWS($U$3:U235),$U$3:$U$281,0)),\"\")","v":""},{"$f":"IFERROR(INDEX($S$3:$S$281,MATCH(ROWS($U$3:V235),$U$3:$U$281,0)),\"\")","v":""},{"$f":"IFERROR(INDEX($S$3:$S$281,MATCH(ROWS($U$3:U235),$U$3:$U$281,0)),\"\")","v":""},null,{"$f":"$V$3:INDEX($V$3:$V$281,MAX($U$3:$U$281),1)","v":"Saltspring Island"}]
[null,null,null,null,null,null,null,null,null,null,null,null,null,null,null,null,null,null,"St Shotts",0,{"$f":"IF(T236=1,COUNTIF($T$3:T236,1),\"\")","v":""},{"$f":"IFERROR(INDEX($S$3:$S$281,MATCH(ROWS($U$3:U236),$U$3:$U$281,0)),\"\")","v":""},{"$f":"IFERROR(INDEX($S$3:$S$281,MATCH(ROWS($U$3:V236),$U$3:$U$281,0)),\"\")","v":""},{"$f":"IFERROR(INDEX($S$3:$S$281,MATCH(ROWS($U$3:U236),$U$3:$U$281,0)),\"\")","v":""},null,{"$f":"$V$3:INDEX($V$3:$V$281,MAX($U$3:$U$281),1)","v":"Saltspring Island"}]
[null,null,null,null,null,null,null,null,null,null,null,null,null,null,null,null,null,null,"Stanhope",0,{"$f":"IF(T237=1,COUNTIF($T$3:T237,1),\"\")","v":""},{"$f":"IFERROR(INDEX($S$3:$S$281,MATCH(ROWS($U$3:U237),$U$3:$U$281,0)),\"\")","v":""},{"$f":"IFERROR(INDEX($S$3:$S$281,MATCH(ROWS($U$3:V237),$U$3:$U$281,0)),\"\")","v":""},{"$f":"IFERROR(INDEX($S$3:$S$281,MATCH(ROWS($U$3:U237),$U$3:$U$281,0)),\"\")","v":""},null,{"$f":"$V$3:INDEX($V$3:$V$281,MAX($U$3:$U$281),1)","v":"Saltspring Island"}]
[null,null,null,null,null,null,null,null,null,null,null,null,null,null,null,null,null,null,"Ste-Agathe-des-Monts",0,{"$f":"IF(T238=1,COUNTIF($T$3:T238,1),\"\")","v":""},{"$f":"IFERROR(INDEX($S$3:$S$281,MATCH(ROWS($U$3:U238),$U$3:$U$281,0)),\"\")","v":""},{"$f":"IFERROR(INDEX($S$3:$S$281,MATCH(ROWS($U$3:V238),$U$3:$U$281,0)),\"\")","v":""},{"$f":"IFERROR(INDEX($S$3:$S$281,MATCH(ROWS($U$3:U238),$U$3:$U$281,0)),\"\")","v":""},null,{"$f":"$V$3:INDEX($V$3:$V$281,MAX($U$3:$U$281),1)","v":"Saltspring Island"}]
[null,null,null,null,null,null,null,null,null,null,null,null,null,null,null,null,null,null,"Ste-Anne-des-Monts",0,{"$f":"IF(T239=1,COUNTIF($T$3:T239,1),\"\")","v":""},{"$f":"IFERROR(INDEX($S$3:$S$281,MATCH(ROWS($U$3:U239),$U$3:$U$281,0)),\"\")","v":""},{"$f":"IFERROR(INDEX($S$3:$S$281,MATCH(ROWS($U$3:V239),$U$3:$U$281,0)),\"\")","v":""},{"$f":"IFERROR(INDEX($S$3:$S$281,MATCH(ROWS($U$3:U239),$U$3:$U$281,0)),\"\")","v":""},null,{"$f":"$V$3:INDEX($V$3:$V$281,MAX($U$3:$U$281),1)","v":"Saltspring Island"}]
[null,null,null,null,null,null,null,null,null,null,null,null,null,null,null,null,null,null,"Steinbach",0,{"$f":"IF(T240=1,COUNTIF($T$3:T240,1),\"\")","v":""},{"$f":"IFERROR(INDEX($S$3:$S$281,MATCH(ROWS($U$3:U240),$U$3:$U$281,0)),\"\")","v":""},{"$f":"IFERROR(INDEX($S$3:$S$281,MATCH(ROWS($U$3:V240),$U$3:$U$281,0)),\"\")","v":""},{"$f":"IFERROR(INDEX($S$3:$S$281,MATCH(ROWS($U$3:U240),$U$3:$U$281,0)),\"\")","v":""},null,{"$f":"$V$3:INDEX($V$3:$V$281,MAX($U$3:$U$281),1)","v":"Saltspring Island"}]
[null,null,null,null,null,null,null,null,null,null,null,null,null,null,null,null,null,null,"Stephenville",0,{"$f":"IF(T241=1,COUNTIF($T$3:T241,1),\"\")","v":""},{"$f":"IFERROR(INDEX($S$3:$S$281,MATCH(ROWS($U$3:U241),$U$3:$U$281,0)),\"\")","v":""},{"$f":"IFERROR(INDEX($S$3:$S$281,MATCH(ROWS($U$3:V241),$U$3:$U$281,0)),\"\")","v":""},{"$f":"IFERROR(INDEX($S$3:$S$281,MATCH(ROWS($U$3:U241),$U$3:$U$281,0)),\"\")","v":""},null,{"$f":"$V$3:INDEX($V$3:$V$281,MAX($U$3:$U$281),1)","v":"Saltspring Island"}]
[null,null,null,null,null,null,null,null,null,null,null,null,null,null,null,null,null,null,"Stillwater - Sherbrooke",0,{"$f":"IF(T242=1,COUNTIF($T$3:T242,1),\"\")","v":""},{"$f":"IFERROR(INDEX($S$3:$S$281,MATCH(ROWS($U$3:U242),$U$3:$U$281,0)),\"\")","v":""},{"$f":"IFERROR(INDEX($S$3:$S$281,MATCH(ROWS($U$3:V242),$U$3:$U$281,0)),\"\")","v":""},{"$f":"IFERROR(INDEX($S$3:$S$281,MATCH(ROWS($U$3:U242),$U$3:$U$281,0)),\"\")","v":""},null,{"$f":"$V$3:INDEX($V$3:$V$281,MAX($U$3:$U$281),1)","v":"Saltspring Island"}]
[null,null,null,null,null,null,null,null,null,null,null,null,null,null,null,null,null,null,"Sudbury",0,{"$f":"IF(T243=1,COUNTIF($T$3:T243,1),\"\")","v":""},{"$f":"IFERROR(INDEX($S$3:$S$281,MATCH(ROWS($U$3:U243),$U$3:$U$281,0)),\"\")","v":""},{"$f":"IFERROR(INDEX($S$3:$S$281,MATCH(ROWS($U$3:V243),$U$3:$U$281,0)),\"\")","v":""},{"$f":"IFERROR(INDEX($S$3:$S$281,MATCH(ROWS($U$3:U243),$U$3:$U$281,0)),\"\")","v":""},null,{"$f":"$V$3:INDEX($V$3:$V$281,MAX($U$3:$U$281),1)","v":"Saltspring Island"}]
[null,null,null,null,null,null,null,null,null,null,null,null,null,null,null,null,null,null,"Summerside",0,{"$f":"IF(T244=1,COUNTIF($T$3:T244,1),\"\")","v":""},{"$f":"IFERROR(INDEX($S$3:$S$281,MATCH(ROWS($U$3:U244),$U$3:$U$281,0)),\"\")","v":""},{"$f":"IFERROR(INDEX($S$3:$S$281,MATCH(ROWS($U$3:V244),$U$3:$U$281,0)),\"\")","v":""},{"$f":"IFERROR(INDEX($S$3:$S$281,MATCH(ROWS($U$3:U244),$U$3:$U$281,0)),\"\")","v":""},null,{"$f":"$V$3:INDEX($V$3:$V$281,MAX($U$3:$U$281),1)","v":"Saltspring Island"}]
[null,null,null,null,null,null,null,null,null,null,null,null,null,null,null,null,null,null,"Sussex",0,{"$f":"IF(T245=1,COUNTIF($T$3:T245,1),\"\")","v":""},{"$f":"IFERROR(INDEX($S$3:$S$281,MATCH(ROWS($U$3:U245),$U$3:$U$281,0)),\"\")","v":""},{"$f":"IFERROR(INDEX($S$3:$S$281,MATCH(ROWS($U$3:V245),$U$3:$U$281,0)),\"\")","v":""},{"$f":"IFERROR(INDEX($S$3:$S$281,MATCH(ROWS($U$3:U245),$U$3:$U$281,0)),\"\")","v":""},null,{"$f":"$V$3:INDEX($V$3:$V$281,MAX($U$3:$U$281),1)","v":"Saltspring Island"}]
[null,null,null,null,null,null,null,null,null,null,null,null,null,null,null,null,null,null,"Swan River",0,{"$f":"IF(T246=1,COUNTIF($T$3:T246,1),\"\")","v":""},{"$f":"IFERROR(INDEX($S$3:$S$281,MATCH(ROWS($U$3:U246),$U$3:$U$281,0)),\"\")","v":""},{"$f":"IFERROR(INDEX($S$3:$S$281,MATCH(ROWS($U$3:V246),$U$3:$U$281,0)),\"\")","v":""},{"$f":"IFERROR(INDEX($S$3:$S$281,MATCH(ROWS($U$3:U246),$U$3:$U$281,0)),\"\")","v":""},null,{"$f":"$V$3:INDEX($V$3:$V$281,MAX($U$3:$U$281),1)","v":"Saltspring Island"}]
[null,null,null,null,null,null,null,null,null,null,null,null,null,null,null,null,null,null,"Swift Current",0,{"$f":"IF(T247=1,COUNTIF($T$3:T247,1),\"\")","v":""},{"$f":"IFERROR(INDEX($S$3:$S$281,MATCH(ROWS($U$3:U247),$U$3:$U$281,0)),\"\")","v":""},{"$f":"IFERROR(INDEX($S$3:$S$281,MATCH(ROWS($U$3:V247),$U$3:$U$281,0)),\"\")","v":""},{"$f":"IFERROR(INDEX($S$3:$S$281,MATCH(ROWS($U$3:U247),$U$3:$U$281,0)),\"\")","v":""},null,{"$f":"$V$3:INDEX($V$3:$V$281,MAX($U$3:$U$281),1)","v":"Saltspring Island"}]
[null,null,null,null,null,null,null,null,null,null,null,null,null,null,null,null,null,null,"Sydney",0,{"$f":"IF(T248=1,COUNTIF($T$3:T248,1),\"\")","v":""},{"$f":"IFERROR(INDEX($S$3:$S$281,MATCH(ROWS($U$3:U248),$U$3:$U$281,0)),\"\")","v":""},{"$f":"IFERROR(INDEX($S$3:$S$281,MATCH(ROWS($U$3:V248),$U$3:$U$281,0)),\"\")","v":""},{"$f":"IFERROR(INDEX($S$3:$S$281,MATCH(ROWS($U$3:U248),$U$3:$U$281,0)),\"\")","v":""},null,{"$f":"$V$3:INDEX($V$3:$V$281,MAX($U$3:$U$281),1)","v":"Saltspring Island"}]
[null,null,null,null,null,null,null,null,null,null,null,null,null,null,null,null,null,null,"Taber",0,{"$f":"IF(T249=1,COUNTIF($T$3:T249,1),\"\")","v":""},{"$f":"IFERROR(INDEX($S$3:$S$281,MATCH(ROWS($U$3:U249),$U$3:$U$281,0)),\"\")","v":""},{"$f":"IFERROR(INDEX($S$3:$S$281,MATCH(ROWS($U$3:V249),$U$3:$U$281,0)),\"\")","v":""},{"$f":"IFERROR(INDEX($S$3:$S$281,MATCH(ROWS($U$3:U249),$U$3:$U$281,0)),\"\")","v":""},null,{"$f":"$V$3:INDEX($V$3:$V$281,MAX($U$3:$U$281),1)","v":"Saltspring Island"}]
[null,null,null,null,null,null,null,null,null,null,null,null,null,null,null,null,null,null,"Tadoussac",0,{"$f":"IF(T250=1,COUNTIF($T$3:T250,1),\"\")","v":""},{"$f":"IFERROR(INDEX($S$3:$S$281,MATCH(ROWS($U$3:U250),$U$3:$U$281,0)),\"\")","v":""},{"$f":"IFERROR(INDEX($S$3:$S$281,MATCH(ROWS($U$3:V250),$U$3:$U$281,0)),\"\")","v":""},{"$f":"IFERROR(INDEX($S$3:$S$281,MATCH(ROWS($U$3:U250),$U$3:$U$281,0)),\"\")","v":""},null,{"$f":"$V$3:INDEX($V$3:$V$281,MAX($U$3:$U$281),1)","v":"Saltspring Island"}]
[null,null,null,null,null,null,null,null,null,null,null,null,null,null,null,null,null,null,"Terra Nova National Park",0,{"$f":"IF(T251=1,COUNTIF($T$3:T251,1),\"\")","v":""},{"$f":"IFERROR(INDEX($S$3:$S$281,MATCH(ROWS($U$3:U251),$U$3:$U$281,0)),\"\")","v":""},{"$f":"IFERROR(INDEX($S$3:$S$281,MATCH(ROWS($U$3:V251),$U$3:$U$281,0)),\"\")","v":""},{"$f":"IFERROR(INDEX($S$3:$S$281,MATCH(ROWS($U$3:U251),$U$3:$U$281,0)),\"\")","v":""},null,{"$f":"$V$3:INDEX($V$3:$V$281,MAX($U$3:$U$281),1)","v":"Saltspring Island"}]
[null,null,null,null,null,null,null,null,null,null,null,null,null,null,null,null,null,null,"The Pas",0,{"$f":"IF(T252=1,COUNTIF($T$3:T252,1),\"\")","v":""},{"$f":"IFERROR(INDEX($S$3:$S$281,MATCH(ROWS($U$3:U252),$U$3:$U$281,0)),\"\")","v":""},{"$f":"IFERROR(INDEX($S$3:$S$281,MATCH(ROWS($U$3:V252),$U$3:$U$281,0)),\"\")","v":""},{"$f":"IFERROR(INDEX($S$3:$S$281,MATCH(ROWS($U$3:U252),$U$3:$U$281,0)),\"\")","v":""},null,{"$f":"$V$3:INDEX($V$3:$V$281,MAX($U$3:$U$281),1)","v":"Saltspring Island"}]
[null,null,null,null,null,null,null,null,null,null,null,null,null,null,null,null,null,null,"Thetford Mines",0,{"$f":"IF(T253=1,COUNTIF($T$3:T253,1),\"\")","v":""},{"$f":"IFERROR(INDEX($S$3:$S$281,MATCH(ROWS($U$3:U253),$U$3:$U$281,0)),\"\")","v":""},{"$f":"IFERROR(INDEX($S$3:$S$281,MATCH(ROWS($U$3:V253),$U$3:$U$281,0)),\"\")","v":""},{"$f":"IFERROR(INDEX($S$3:$S$281,MATCH(ROWS($U$3:U253),$U$3:$U$281,0)),\"\")","v":""},null,{"$f":"$V$3:INDEX($V$3:$V$281,MAX($U$3:$U$281),1)","v":"Saltspring Island"}]
[null,null,null,null,null,null,null,null,null,null,null,null,null,null,null,null,null,null,"Thompson",0,{"$f":"IF(T254=1,COUNTIF($T$3:T254,1),\"\")","v":""},{"$f":"IFERROR(INDEX($S$3:$S$281,MATCH(ROWS($U$3:U254),$U$3:$U$281,0)),\"\")","v":""},{"$f":"IFERROR(INDEX($S$3:$S$281,MATCH(ROWS($U$3:V254),$U$3:$U$281,0)),\"\")","v":""},{"$f":"IFERROR(INDEX($S$3:$S$281,MATCH(ROWS($U$3:U254),$U$3:$U$281,0)),\"\")","v":""},null,{"$f":"$V$3:INDEX($V$3:$V$281,MAX($U$3:$U$281),1)","v":"Saltspring Island"}]
[null,null,null,null,null,null,null,null,null,null,null,null,null,null,null,null,null,null,"Thunder Bay",0,{"$f":"IF(T255=1,COUNTIF($T$3:T255,1),\"\")","v":""},{"$f":"IFERROR(INDEX($S$3:$S$281,MATCH(ROWS($U$3:U255),$U$3:$U$281,0)),\"\")","v":""},{"$f":"IFERROR(INDEX($S$3:$S$281,MATCH(ROWS($U$3:V255),$U$3:$U$281,0)),\"\")","v":""},{"$f":"IFERROR(INDEX($S$3:$S$281,MATCH(ROWS($U$3:U255),$U$3:$U$281,0)),\"\")","v":""},null,{"$f":"$V$3:INDEX($V$3:$V$281,MAX($U$3:$U$281),1)","v":"Saltspring Island"}]
[null,null,null,null,null,null,null,null,null,null,null,null,null,null,null,null,null,null,"Tignish",0,{"$f":"IF(T256=1,COUNTIF($T$3:T256,1),\"\")","v":""},{"$f":"IFERROR(INDEX($S$3:$S$281,MATCH(ROWS($U$3:U256),$U$3:$U$281,0)),\"\")","v":""},{"$f":"IFERROR(INDEX($S$3:$S$281,MATCH(ROWS($U$3:V256),$U$3:$U$281,0)),\"\")","v":""},{"$f":"IFERROR(INDEX($S$3:$S$281,MATCH(ROWS($U$3:U256),$U$3:$U$281,0)),\"\")","v":""},null,{"$f":"$V$3:INDEX($V$3:$V$281,MAX($U$3:$U$281),1)","v":"Saltspring Island"}]
[null,null,null,null,null,null,null,null,null,null,null,null,null,null,null,null,null,null,"Timmins",0,{"$f":"IF(T257=1,COUNTIF($T$3:T257,1),\"\")","v":""},{"$f":"IFERROR(INDEX($S$3:$S$281,MATCH(ROWS($U$3:U257),$U$3:$U$281,0)),\"\")","v":""},{"$f":"IFERROR(INDEX($S$3:$S$281,MATCH(ROWS($U$3:V257),$U$3:$U$281,0)),\"\")","v":""},{"$f":"IFERROR(INDEX($S$3:$S$281,MATCH(ROWS($U$3:U257),$U$3:$U$281,0)),\"\")","v":""},null,{"$f":"$V$3:INDEX($V$3:$V$281,MAX($U$3:$U$281),1)","v":"Saltspring Island"}]
[null,null,null,null,null,null,null,null,null,null,null,null,null,null,null,null,null,null,"Tofino",0,{"$f":"IF(T258=1,COUNTIF($T$3:T258,1),\"\")","v":""},{"$f":"IFERROR(INDEX($S$3:$S$281,MATCH(ROWS($U$3:U258),$U$3:$U$281,0)),\"\")","v":""},{"$f":"IFERROR(INDEX($S$3:$S$281,MATCH(ROWS($U$3:V258),$U$3:$U$281,0)),\"\")","v":""},{"$f":"IFERROR(INDEX($S$3:$S$281,MATCH(ROWS($U$3:U258),$U$3:$U$281,0)),\"\")","v":""},null,{"$f":"$V$3:INDEX($V$3:$V$281,MAX($U$3:$U$281),1)","v":"Saltspring Island"}]
[null,null,null,null,null,null,null,null,null,null,null,null,null,null,null,null,null,null,"Toronto",0,{"$f":"IF(T259=1,COUNTIF($T$3:T259,1),\"\")","v":""},{"$f":"IFERROR(INDEX($S$3:$S$281,MATCH(ROWS($U$3:U259),$U$3:$U$281,0)),\"\")","v":""},{"$f":"IFERROR(INDEX($S$3:$S$281,MATCH(ROWS($U$3:V259),$U$3:$U$281,0)),\"\")","v":""},{"$f":"IFERROR(INDEX($S$3:$S$281,MATCH(ROWS($U$3:U259),$U$3:$U$281,0)),\"\")","v":""},null,{"$f":"$V$3:INDEX($V$3:$V$281,MAX($U$3:$U$281),1)","v":"Saltspring Island"}]
[null,null,null,null,null,null,null,null,null,null,null,null,null,null,null,null,null,null,"Trois-Rivières",0,{"$f":"IF(T260=1,COUNTIF($T$3:T260,1),\"\")","v":""},{"$f":"IFERROR(INDEX($S$3:$S$281,MATCH(ROWS($U$3:U260),$U$3:$U$281,0)),\"\")","v":""},{"$f":"IFERROR(INDEX($S$3:$S$281,MATCH(ROWS($U$3:V260),$U$3:$U$281,0)),\"\")","v":""},{"$f":"IFERROR(INDEX($S$3:$S$281,MATCH(ROWS($U$3:U260),$U$3:$U$281,0)),\"\")","v":""},null,{"$f":"$V$3:INDEX($V$3:$V$281,MAX($U$3:$U$281),1)","v":"Saltspring Island"}]
[null,null,null,null,null,null,null,null,null,null,null,null,null,null,null,null,null,null,"Truro",0,{"$f":"IF(T261=1,COUNTIF($T$3:T261,1),\"\")","v":""},{"$f":"IFERROR(INDEX($S$3:$S$281,MATCH(ROWS($U$3:U261),$U$3:$U$281,0)),\"\")","v":""},{"$f":"IFERROR(INDEX($S$3:$S$281,MATCH(ROWS($U$3:V261),$U$3:$U$281,0)),\"\")","v":""},{"$f":"IFERROR(INDEX($S$3:$S$281,MATCH(ROWS($U$3:U261),$U$3:$U$281,0)),\"\")","v":""},null,{"$f":"$V$3:INDEX($V$3:$V$281,MAX($U$3:$U$281),1)","v":"Saltspring Island"}]
[null,null,null,null,null,null,null,null,null,null,null,null,null,null,null,null,null,null,"Turtle Mountain Park",0,{"$f":"IF(T262=1,COUNTIF($T$3:T262,1),\"\")","v":""},{"$f":"IFERROR(INDEX($S$3:$S$281,MATCH(ROWS($U$3:U262),$U$3:$U$281,0)),\"\")","v":""},{"$f":"IFERROR(INDEX($S$3:$S$281,MATCH(ROWS($U$3:V262),$U$3:$U$281,0)),\"\")","v":""},{"$f":"IFERROR(INDEX($S$3:$S$281,MATCH(ROWS($U$3:U262),$U$3:$U$281,0)),\"\")","v":""},null,{"$f":"$V$3:INDEX($V$3:$V$281,MAX($U$3:$U$281),1)","v":"Saltspring Island"}]
[null,null,null,null,null,null,null,null,null,null,null,null,null,null,null,null,null,null,"Upsalquitch Lake",0,{"$f":"IF(T263=1,COUNTIF($T$3:T263,1),\"\")","v":""},{"$f":"IFERROR(INDEX($S$3:$S$281,MATCH(ROWS($U$3:U263),$U$3:$U$281,0)),\"\")","v":""},{"$f":"IFERROR(INDEX($S$3:$S$281,MATCH(ROWS($U$3:V263),$U$3:$U$281,0)),\"\")","v":""},{"$f":"IFERROR(INDEX($S$3:$S$281,MATCH(ROWS($U$3:U263),$U$3:$U$281,0)),\"\")","v":""},null,{"$f":"$V$3:INDEX($V$3:$V$281,MAX($U$3:$U$281),1)","v":"Saltspring Island"}]
[null,null,null,null,null,null,null,null,null,null,null,null,null,null,null,null,null,null,"Val-D'or",0,{"$f":"IF(T264=1,COUNTIF($T$3:T264,1),\"\")","v":""},{"$f":"IFERROR(INDEX($S$3:$S$281,MATCH(ROWS($U$3:U264),$U$3:$U$281,0)),\"\")","v":""},{"$f":"IFERROR(INDEX($S$3:$S$281,MATCH(ROWS($U$3:V264),$U$3:$U$281,0)),\"\")","v":""},{"$f":"IFERROR(INDEX($S$3:$S$281,MATCH(ROWS($U$3:U264),$U$3:$U$281,0)),\"\")","v":""},null,{"$f":"$V$3:INDEX($V$3:$V$281,MAX($U$3:$U$281),1)","v":"Saltspring Island"}]
[null,null,null,null,null,null,null,null,null,null,null,null,null,null,null,null,null,null,"Vancouver",0,{"$f":"IF(T265=1,COUNTIF($T$3:T265,1),\"\")","v":""},{"$f":"IFERROR(INDEX($S$3:$S$281,MATCH(ROWS($U$3:U265),$U$3:$U$281,0)),\"\")","v":""},{"$f":"IFERROR(INDEX($S$3:$S$281,MATCH(ROWS($U$3:V265),$U$3:$U$281,0)),\"\")","v":""},{"$f":"IFERROR(INDEX($S$3:$S$281,MATCH(ROWS($U$3:U265),$U$3:$U$281,0)),\"\")","v":""},null,{"$f":"$V$3:INDEX($V$3:$V$281,MAX($U$3:$U$281),1)","v":"Saltspring Island"}]
[null,null,null,null,null,null,null,null,null,null,null,null,null,null,null,null,null,null,"Vernon",0,{"$f":"IF(T266=1,COUNTIF($T$3:T266,1),\"\")","v":""},{"$f":"IFERROR(INDEX($S$3:$S$281,MATCH(ROWS($U$3:U266),$U$3:$U$281,0)),\"\")","v":""},{"$f":"IFERROR(INDEX($S$3:$S$281,MATCH(ROWS($U$3:V266),$U$3:$U$281,0)),\"\")","v":""},{"$f":"IFERROR(INDEX($S$3:$S$281,MATCH(ROWS($U$3:U266),$U$3:$U$281,0)),\"\")","v":""},null,{"$f":"$V$3:INDEX($V$3:$V$281,MAX($U$3:$U$281),1)","v":"Saltspring Island"}]
[null,null,null,null,null,null,null,null,null,null,null,null,null,null,null,null,null,null,"Victoria",0,{"$f":"IF(T267=1,COUNTIF($T$3:T267,1),\"\")","v":""},{"$f":"IFERROR(INDEX($S$3:$S$281,MATCH(ROWS($U$3:U267),$U$3:$U$281,0)),\"\")","v":""},{"$f":"IFERROR(INDEX($S$3:$S$281,MATCH(ROWS($U$3:V267),$U$3:$U$281,0)),\"\")","v":""},{"$f":"IFERROR(INDEX($S$3:$S$281,MATCH(ROWS($U$3:U267),$U$3:$U$281,0)),\"\")","v":""},null,{"$f":"$V$3:INDEX($V$3:$V$281,MAX($U$3:$U$281),1)","v":"Saltspring Island"}]
[null,null,null,null,null,null,null,null,null,null,null,null,null,null,null,null,null,null,"Victoria",0,{"$f":"IF(T268=1,COUNTIF($T$3:T268,1),\"\")","v":""},{"$f":"IFERROR(INDEX($S$3:$S$281,MATCH(ROWS($U$3:U268),$U$3:$U$281,0)),\"\")","v":""},{"$f":"IFERROR(INDEX($S$3:$S$281,MATCH(ROWS($U$3:V268),$U$3:$U$281,0)),\"\")","v":""},{"$f":"IFERROR(INDEX($S$3:$S$281,MATCH(ROWS($U$3:U268),$U$3:$U$281,0)),\"\")","v":""},null,{"$f":"$V$3:INDEX($V$3:$V$281,MAX($U$3:$U$281),1)","v":"Saltspring Island"}]
[null,null,null,null,null,null,null,null,null,null,null,null,null,null,null,null,null,null,"Wabush Lake",0,{"$f":"IF(T269=1,COUNTIF($T$3:T269,1),\"\")","v":""},{"$f":"IFERROR(INDEX($S$3:$S$281,MATCH(ROWS($U$3:U269),$U$3:$U$281,0)),\"\")","v":""},{"$f":"IFERROR(INDEX($S$3:$S$281,MATCH(ROWS($U$3:V269),$U$3:$U$281,0)),\"\")","v":""},{"$f":"IFERROR(INDEX($S$3:$S$281,MATCH(ROWS($U$3:U269),$U$3:$U$281,0)),\"\")","v":""},null,{"$f":"$V$3:INDEX($V$3:$V$281,MAX($U$3:$U$281),1)","v":"Saltspring Island"}]
[null,null,null,null,null,null,null,null,null,null,null,null,null,null,null,null,null,null,"Waterloo",0,{"$f":"IF(T270=1,COUNTIF($T$3:T270,1),\"\")","v":""},{"$f":"IFERROR(INDEX($S$3:$S$281,MATCH(ROWS($U$3:U270),$U$3:$U$281,0)),\"\")","v":""},{"$f":"IFERROR(INDEX($S$3:$S$281,MATCH(ROWS($U$3:V270),$U$3:$U$281,0)),\"\")","v":""},{"$f":"IFERROR(INDEX($S$3:$S$281,MATCH(ROWS($U$3:U270),$U$3:$U$281,0)),\"\")","v":""},null,{"$f":"$V$3:INDEX($V$3:$V$281,MAX($U$3:$U$281),1)","v":"Saltspring Island"}]
[null,null,null,null,null,null,null,null,null,null,null,null,null,null,null,null,null,null,"Waterton Village",{"$f":"--ISNUMBER(IFERROR(SEARCH($K$2,S271,1),\"\"))","v":0},{"$f":"IF(T271=1,COUNTIF($T$3:T271,1),\"\")","v":""},{"$f":"IFERROR(INDEX($S$3:$S$281,MATCH(ROWS($U$3:U271),$U$3:$U$281,0)),\"\")","v":""},{"$f":"IFERROR(INDEX($S$3:$S$281,MATCH(ROWS($U$3:V271),$U$3:$U$281,0)),\"\")","v":""},{"$f":"IFERROR(INDEX($S$3:$S$281,MATCH(ROWS($U$3:U271),$U$3:$U$281,0)),\"\")","v":""},null,{"$f":"$V$3:INDEX($V$3:$V$281,MAX($U$3:$U$281),1)","v":"Saltspring Island"}]
[null,null,null,null,null,null,null,null,null,null,null,null,null,null,null,null,null,null,"Wawa",0,{"$f":"IF(T272=1,COUNTIF($T$3:T272,1),\"\")","v":""},{"$f":"IFERROR(INDEX($S$3:$S$281,MATCH(ROWS($U$3:U272),$U$3:$U$281,0)),\"\")","v":""},{"$f":"IFERROR(INDEX($S$3:$S$281,MATCH(ROWS($U$3:V272),$U$3:$U$281,0)),\"\")","v":""},{"$f":"IFERROR(INDEX($S$3:$S$281,MATCH(ROWS($U$3:U272),$U$3:$U$281,0)),\"\")","v":""},null,{"$f":"$V$3:INDEX($V$3:$V$281,MAX($U$3:$U$281),1)","v":"Saltspring Island"}]
[null,null,null,null,null,null,null,null,null,null,null,null,null,null,null,null,null,null,"Weyburn",0,{"$f":"IF(T273=1,COUNTIF($T$3:T273,1),\"\")","v":""},{"$f":"IFERROR(INDEX($S$3:$S$281,MATCH(ROWS($U$3:U273),$U$3:$U$281,0)),\"\")","v":""},{"$f":"IFERROR(INDEX($S$3:$S$281,MATCH(ROWS($U$3:V273),$U$3:$U$281,0)),\"\")","v":""},{"$f":"IFERROR(INDEX($S$3:$S$281,MATCH(ROWS($U$3:U273),$U$3:$U$281,0)),\"\")","v":""},null,{"$f":"$V$3:INDEX($V$3:$V$281,MAX($U$3:$U$281),1)","v":"Saltspring Island"}]
[null,null,null,null,null,null,null,null,null,null,null,null,null,null,null,null,null,null,"Whistler",0,{"$f":"IF(T274=1,COUNTIF($T$3:T274,1),\"\")","v":""},{"$f":"IFERROR(INDEX($S$3:$S$281,MATCH(ROWS($U$3:U274),$U$3:$U$281,0)),\"\")","v":""},{"$f":"IFERROR(INDEX($S$3:$S$281,MATCH(ROWS($U$3:V274),$U$3:$U$281,0)),\"\")","v":""},{"$f":"IFERROR(INDEX($S$3:$S$281,MATCH(ROWS($U$3:U274),$U$3:$U$281,0)),\"\")","v":""},null,{"$f":"$V$3:INDEX($V$3:$V$281,MAX($U$3:$U$281),1)","v":"Saltspring Island"}]
[null,null,null,null,null,null,null,null,null,null,null,null,null,null,null,null,null,null,"Wiggins Point",0,{"$f":"IF(T275=1,COUNTIF($T$3:T275,1),\"\")","v":""},{"$f":"IFERROR(INDEX($S$3:$S$281,MATCH(ROWS($U$3:U275),$U$3:$U$281,0)),\"\")","v":""},{"$f":"IFERROR(INDEX($S$3:$S$281,MATCH(ROWS($U$3:V275),$U$3:$U$281,0)),\"\")","v":""},{"$f":"IFERROR(INDEX($S$3:$S$281,MATCH(ROWS($U$3:U275),$U$3:$U$281,0)),\"\")","v":""},null,{"$f":"$V$3:INDEX($V$3:$V$281,MAX($U$3:$U$281),1)","v":"Saltspring Island"}]
[null,null,null,null,null,null,null,null,null,null,null,null,null,null,null,null,null,null,"Williams Lake",0,{"$f":"IF(T276=1,COUNTIF($T$3:T276,1),\"\")","v":""},{"$f":"IFERROR(INDEX($S$3:$S$281,MATCH(ROWS($U$3:U276),$U$3:$U$281,0)),\"\")","v":""},{"$f":"IFERROR(INDEX($S$3:$S$281,MATCH(ROWS($U$3:V276),$U$3:$U$281,0)),\"\")","v":""},{"$f":"IFERROR(INDEX($S$3:$S$281,MATCH(ROWS($U$3:U276),$U$3:$U$281,0)),\"\")","v":""},null,{"$f":"$V$3:INDEX($V$3:$V$281,MAX($U$3:$U$281),1)","v":"Saltspring Island"}]
[null,null,null,null,null,null,null,null,null,null,null,null,null,null,null,null,null,null,"Windsor",0,{"$f":"IF(T277=1,COUNTIF($T$3:T277,1),\"\")","v":""},{"$f":"IFERROR(INDEX($S$3:$S$281,MATCH(ROWS($U$3:U277),$U$3:$U$281,0)),\"\")","v":""},{"$f":"IFERROR(INDEX($S$3:$S$281,MATCH(ROWS($U$3:V277),$U$3:$U$281,0)),\"\")","v":""},{"$f":"IFERROR(INDEX($S$3:$S$281,MATCH(ROWS($U$3:U277),$U$3:$U$281,0)),\"\")","v":""},null,{"$f":"$V$3:INDEX($V$3:$V$281,MAX($U$3:$U$281),1)","v":"Saltspring Island"}]
[null,null,null,null,null,null,null,null,null,null,null,null,null,null,null,null,null,null,"Winnipeg",0,{"$f":"IF(T278=1,COUNTIF($T$3:T278,1),\"\")","v":""},{"$f":"IFERROR(INDEX($S$3:$S$281,MATCH(ROWS($U$3:U278),$U$3:$U$281,0)),\"\")","v":""},{"$f":"IFERROR(INDEX($S$3:$S$281,MATCH(ROWS($U$3:V278),$U$3:$U$281,0)),\"\")","v":""},{"$f":"IFERROR(INDEX($S$3:$S$281,MATCH(ROWS($U$3:U278),$U$3:$U$281,0)),\"\")","v":""},null,{"$f":"$V$3:INDEX($V$3:$V$281,MAX($U$3:$U$281),1)","v":"Saltspring Island"}]
[null,null,null,null,null,null,null,null,null,null,null,null,null,null,null,null,null,null,"Woodstock",0,{"$f":"IF(T279=1,COUNTIF($T$3:T279,1),\"\")","v":""},{"$f":"IFERROR(INDEX($S$3:$S$281,MATCH(ROWS($U$3:U279),$U$3:$U$281,0)),\"\")","v":""},{"$f":"IFERROR(INDEX($S$3:$S$281,MATCH(ROWS($U$3:V279),$U$3:$U$281,0)),\"\")","v":""},{"$f":"IFERROR(INDEX($S$3:$S$281,MATCH(ROWS($U$3:U279),$U$3:$U$281,0)),\"\")","v":""},null,{"$f":"$V$3:INDEX($V$3:$V$281,MAX($U$3:$U$281),1)","v":"Saltspring Island"}]
[null,null,null,null,null,null,null,null,null,null,null,null,null,null,null,null,null,null,"Yarmouth",0,{"$f":"IF(T280=1,COUNTIF($T$3:T280,1),\"\")","v":""},{"$f":"IFERROR(INDEX($S$3:$S$281,MATCH(ROWS($U$3:U280),$U$3:$U$281,0)),\"\")","v":""},{"$f":"IFERROR(INDEX($S$3:$S$281,MATCH(ROWS($U$3:V280),$U$3:$U$281,0)),\"\")","v":""},{"$f":"IFERROR(INDEX($S$3:$S$281,MATCH(ROWS($U$3:U280),$U$3:$U$281,0)),\"\")","v":""},null,{"$f":"$V$3:INDEX($V$3:$V$281,MAX($U$3:$U$281),1)","v":"Saltspring Island"}]
[null,null,null,null,null,null,null,null,null,null,null,null,null,null,null,null,null,null,"Yorkton",0,{"$f":"IF(T281=1,COUNTIF($T$3:T281,1),\"\")","v":""},{"$f":"IFERROR(INDEX($S$3:$S$281,MATCH(ROWS($U$3:U281),$U$3:$U$281,0)),\"\")","v":""},{"$f":"IFERROR(INDEX($S$3:$S$281,MATCH(ROWS($U$3:V281),$U$3:$U$281,0)),\"\")","v":""},{"$f":"IFERROR(INDEX($S$3:$S$281,MATCH(ROWS($U$3:U281),$U$3:$U$281,0)),\"\")","v":""},null,{"$f":"$V$3:INDEX($V$3:$V$281,MAX($U$3:$U$281),1)","v":"Saltspring Island"}]

{"sheet":"Rainfall Data","index":1,"n_rows":271,"n_cols":13,"rows_kept":271,"cut":false,"hidden":true,"merged":[[1,0,1,1]]}
[]
[]
["Place","JAN","FEB","MAR","APR","MAY","JUN","JUL","AUG","SEPT","OCT","NOV","DEC"]
["Abbotsford",212,132,149,118,100,75,43,46,75,153,248,187]
["Alberton",96,74,81,80,93,82,86,80,92,96,99,94]
["Alliston",93,79,75,96,83,94,89,75,128,127,123,117]
["Amherst - Nappan",106,83,105,92,101,83,89,74,102,103,111,107]
["Amos",56,36,50,65,87,94,112,98,107,87,79,58]
["Annapolis Royal",114,85,94,95,86,74,69,69,110,120,125,113]
["Atikokan",35,25,33,50,77,104,118,88,100,76,45,36]
["Atlin",46,25,17,9,18,30,33,34,42,37,36,36]
["Baddeck",155,126,129,126,104,105,97,107,128,137,155,166]
["Baie Verte",104,87,75,74,79,108,86,115,92,112,88,96]
["Baie-Comeau",83,65,68,80,91,89,93,75,86,95,96,79]
["Baltic",116,91,96,93,93,101,87,104,115,122,126,129]
["Banff",20,17,21,34,62,68,68,62,39,32,26,21]
["Bangor",120,99,99,94,96,94,82,96,112,120,129,141]
["Barkerville",96,61,66,58,78,102,100,81,82,92,111,95]
["Barrie",83,62,58,62,82,85,77,90,94,78,89,74]
["Bathurst",98,68,73,91,77,92,96,118,72,84,107,95]
["Bella Coola",157,88,76,56,48,51,42,60,90,195,205,131]
["Belleville",67,58,62,76,81,74,65,75,92,85,96,79]
["Big Trout Lake",22,19,31,33,40,80,85,89,90,50,55,28]
["Blanc-Sablon",97,84,80,50,69,92,102,96,89,88,75,100]
["Bonavista",101,104,103,83,76,90,82,79,108,115,105,107]
["Brandon",18,13,25,26,59,81,73,66,44,30,19,21]
["Brantford",55,51,59,69,81,76,95,75,87,70,84,65]
["Bridgewater",144,120,156,127,128,104,97,100,111,137,165,148]
["Brooks",13,9,19,22,35,74,26,38,29,11,13,12]
["Buctouche",104,88,93,86,101,95,99,85,86,95,103,101]
["Buffalo Narrows",21,19,17,26,40,62,80,62,44,32,25,22]
["Burgeo",156,124,110,138,127,155,138,129,144,155,164,146]
["Calgary",9,9,18,25,57,94,66,57,45,15,13,10]
["Campbell River",217,149,140,92,68,63,39,45,55,162,232,226]
["Camrose",23,14,23,29,41,74,86,52,40,24,19,15]
["Caplan",80,56,60,64,92,87,100,95,79,88,86,70]
["Cardston",21,19,37,41,81,91,45,44,53,32,30,21]
["Cartwright",86,91,92,75,68,99,101,94,89,102,85,92]
["Castlegar",76,51,63,59,70,72,48,30,42,51,97,90]
["Channel-Port-Aux-Basques",152,125,108,139,119,127,113,119,125,145,151,172]
["Chapleau",52,43,47,53,70,80,82,76,95,83,64,64]
["Charlottetown",101,83,86,84,91,99,80,96,96,112,113,118]
["Chatham-Kent",63,54,60,80,80,78,85,79,89,71,77,67]
["Cheticamp",143,108,103,88,85,96,90,114,124,130,141,153]
["Chilliwack",233,126,155,116,93,92,48,57,75,178,284,210]
["Churchill",19,17,18,24,30,44,60,69,70,48,35,18]
["Churchill Falls",53,44,55,64,61,80,112,93,111,82,78,54]
["Cold Lake",16,11,17,31,41,73,79,57,39,20,19,18]
["Collins Bay",21,21,27,22,49,50,77,92,60,47,36,26]
["Come By Chance",130,117,109,96,95,132,93,89,118,131,120,110]
["Corner Brook",145,106,93,80,86,87,92,107,106,112,122,149]
["Cornwall",76,60,62,81,88,97,99,89,98,93,92,76]
["Cortes Island, Whaletown",184,131,107,100,73,70,49,55,61,155,224,181]
["Courtenay - Comox",172,114,106,65,46,43,27,29,42,123,201,188]
["Cranbrook",26,19,22,25,46,62,38,28,31,20,35,33]
["Cree Lake",18,16,16,24,31,67,84,67,45,35,29,17]
["Cross Lake",16,18,16,19,42,68,77,70,60,34,25,23]
["Cypress Hills",28,22,35,46,62,122,40,39,49,26,21,31]
["Dalhousie",84,67,77,72,85,85,102,90,79,84,92,80]
["Dauphin",14,11,24,30,55,82,73,61,58,35,21,19]
["Deer Lake",114,84,73,70,77,81,95,110,100,89,91,111]
["Doaktown",106,77,90,83,113,95,106,94,100,101,112,97]
["Drummondville",86,72,70,80,94,102,106,106,95,102,104,98]
["Dryden",27,20,30,40,73,115,103,84,89,64,47,29]
["Duncan",277,146,154,81,56,41,23,35,41,153,247,254]
["Edmonton",22,12,16,29,46,77,94,62,43,22,18,15]
["Edson",27,12,18,23,54,94,108,75,64,25,20,18]
["Emerson",27,21,25,29,58,90,94,74,57,47,37,33]
["Estevan",18,14,22,24,56,75,67,52,36,28,17,17]
["Fermont",48,31,43,41,47,79,118,101,104,63,58,51]
["Flin Flon",18,15,19,28,41,67,83,67,64,38,26,22]
["Fort Chipewyan",15,14,16,16,27,44,67,50,44,29,24,18]
["Fort Frances",35,22,26,41,78,119,97,92,83,57,46,32]
["Fort McMurray",18,13,17,21,36,73,81,57,40,26,20,16]
["Fort Nelson",21,15,19,19,49,63,78,71,40,33,26,18]
["Fort St John",25,19,24,20,38,66,75,51,45,31,29,22]
["Fredericton",95,73,93,86,96,82,88,86,88,89,106,95]
["French River, Chaudiere Dam",75,61,59,67,90,74,80,79,106,100,87,80]
["Fundy National Park",145,108,146,121,127,110,99,94,123,133,159,147]
["Gabriola Island",147,96,92,63,48,43,24,27,34,86,157,141]
["Gander",112,105,113,95,90,88,95,104,115,114,113,127]
["Gaspé",88,65,98,90,89,80,100,94,82,121,111,117]
["Gibsons",183,110,125,104,91,67,41,49,60,152,213,174]
["Gillam",20,19,23,22,43,56,79,76,57,42,38,23]
["Gimli",20,14,31,28,42,104,78,57,58,47,28,20]
["Gold River",424,286,266,187,120,91,56,71,109,359,491,391]
["Golden",46,24,24,24,34,50,51,45,38,35,51,44]
["Good Spirit Lake",15,13,24,26,60,86,78,66,47,27,19,22]
["Gore Bay",45,30,63,67,61,65,48,65,88,107,94,70]
["Granby",97,73,87,90,97,116,118,123,105,103,105,102]
["Grand Falls",94,94,91,84,78,89,89,107,96,94,94,90]
["Grand Rapids",18,13,21,26,52,77,71,66,59,38,26,22]
["Grande Prairie",30,16,17,20,41,76,76,56,43,26,25,19]
["Gros Morne National Park",237,138,93,81,85,123,96,133,127,159,156,200]
["Guelph",52,58,67,74,80,79,96,93,90,72,91,81]
["Halifax",140,110,132,118,119,112,110,96,109,124,151,145]
["Hamilton",57,57,64,73,85,73,83,90,81,72,91,72]
["Happy Valley - Goose Bay",65,57,65,64,69,91,121,99,91,81,72,64]
["Harbour Breton",112,120,102,125,117,138,119,93,140,147,150,121]
["Harbour Grace",124,124,115,94,85,121,89,89,135,138,112,103]
["High Level",20,18,18,15,36,51,66,43,32,31,25,19]
["Hodgson",36,23,35,29,62,87,69,67,59,47,37,43]
["Huntsville",93,72,68,61,89,78,83,81,111,105,99,94]
["Iles de la Madeleine",97,74,76,74,86,76,76,85,96,94,109,94]
["Ingonish Beach",186,140,154,169,109,91,93,114,144,176,190,188]
["Inukjuak",14,13,17,22,29,41,53,58,82,57,46,27]
["Jasper",23,14,17,20,31,51,64,64,34,30,24,20]
["Joliette",78,61,66,83,84,107,90,90,95,92,96,78]
["Kamloops",21,12,13,14,27,37,31,24,29,19,23,25]
["Kapuskasing",48,36,48,55,69,80,102,77,101,86,71,56]
["Kedgwick",72,59,50,61,84,106,122,103,86,95,80,73]
["Kejimkujik National Park",136,102,125,124,99,102,98,90,83,97,152,140]
["Kelowna",30,20,21,24,31,40,33,26,27,24,35,32]
["Kenora",26,19,28,36,81,119,103,84,86,63,42,28]
["Kentville",116,101,110,93,102,82,84,77,84,89,122,122]
["Kindersley",11,7,12,23,40,67,56,44,29,13,11,12]
["Kingston",65,65,69,87,77,72,64,94,90,92,100,84]
["Kouchibouguac National Park",138,99,123,107,112,91,110,87,84,100,121,125]
["Kuujjuaq",32,29,32,27,29,50,60,71,74,55,48,36]
["Kuujjuarapik",28,23,23,24,33,60,76,92,109,82,66,46]
["La Ronge",19,15,21,36,44,67,81,61,56,37,28,23]
["La Tuque",58,46,55,55,84,94,130,94,95,82,74,53]
["Lachute",91,70,73,88,96,115,100,104,108,110,106,90]
["Last Mountain Lake",17,10,18,26,43,75,54,51,33,21,15,18]
["Lethbridge",13,12,23,28,50,82,43,37,41,20,18,13]
["Lillooet",38,20,17,19,26,24,36,26,24,34,44,42]
["Liverpool - Milton",159,137,165,146,136,109,98,89,122,128,180,176]
["Lloydminster",16,10,14,26,45,71,75,60,42,18,18,14]
["Lloydminster",21,14,20,31,38,63,71,50,33,18,29,24]
["London",74,65,72,83,90,92,83,83,103,81,98,87]
["Long Harbour",130,118,116,112,92,121,102,97,126,135,127,117]
["Long River",84,64,69,75,98,92,82,91,101,103,105,93]
["Louisbourg",147,138,144,148,128,113,108,108,133,158,169,153]
["Lynn Lake",20,16,20,24,37,62,85,69,61,38,27,19]
["Mactaquac Provincial Park",101,64,90,86,100,87,98,85,92,97,101,99]
["Makkovik",73,75,73,62,52,94,101,98,92,92,84,84]
["Maniwaki",55,52,66,65,85,83,79,111,77,93,82,64]
["Mary's Harbour",69,81,67,51,73,95,86,89,68,93,84,87]
["Mayne Island, Village Bay",130,88,75,55,44,37,21,24,28,80,135,125]
["McCreary",21,18,34,30,63,88,74,62,58,43,26,23]
["Meadow Lake",16,10,14,25,44,66,75,63,41,23,19,18]
["Medicine Hat",13,8,19,20,44,65,36,34,37,19,15,12]
["Melfort",15,10,17,27,43,54,77,52,39,28,17,18]
["Midland",103,64,56,70,84,81,78,78,95,94,104,95]
["Miramichi",87,71,91,85,99,86,100,93,84,90,101,85]
["Moncton",98,84,106,92,102,88,85,77,94,106,94,100]
["Mont Laurier",69,54,62,71,90,93,101,100,93,98,89,77]
["Monticello",101,82,87,87,90,91,79,89,108,115,124,118]
["Montréal",77,63,69,82,81,87,89,94,83,91,96,87]
["Moose Jaw",17,11,20,18,48,59,63,39,38,20,17,17]
["Moosomin",21,15,26,24,66,90,78,64,56,35,20,19]
["Moosonee",33,29,35,38,55,72,97,78,95,75,56,42]
["Morden",19,19,22,35,58,93,79,71,45,50,30,20]
["Mount Carleton Provincial Park",99,68,77,76,93,105,119,104,97,95,97,91]
["Musgrave Harbour",88,82,76,74,73,75,82,93,110,100,93,98]
["Nain",84,71,74,71,57,83,99,71,82,74,78,82]
["Nanaimo",188,126,113,67,54,43,25,28,36,102,197,184]
["Natashquan",91,70,90,80,86,88,105,92,95,104,103,94]
["New Glasgow",120,87,96,97,102,98,79,88,107,123,129,133]
["Niagara Falls",64,64,68,75,83,85,84,78,88,84,102,87]
["Nipawin",15,12,15,25,43,74,83,57,41,28,16,18]
["North Battleford",16,10,14,26,33,65,74,58,34,16,16,14]
["North Bay",69,57,65,72,96,98,99,91,115,107,98,78]
["North Vancouver, Capilano",330,279,218,207,132,124,61,72,98,248,437,316]
["Norway House",21,23,24,25,50,70,80,75,61,47,29,27]
["O'Leary",99,82,89,86,103,85,96,88,102,100,112,107]
["Oshawa",66,57,54,73,79,74,73,77,94,70,85,71]
["Ottawa",63,50,57,71,87,93,84,84,93,86,83,70]
["Owen Sound",129,86,78,71,84,73,70,79,106,98,110,130]
["Parrsboro",115,89,115,104,105,102,90,86,113,109,120,122]
["Pembroke",48,42,56,60,76,70,75,83,84,77,69,59]
["Penticton",27,20,24,26,39,46,29,28,25,26,28,29]
["Peterborough",55,61,54,70,83,73,61,96,84,77,83,74]
["Pictou",110,95,100,94,84,90,77,81,118,129,135,121]
["Point Pelee National Park",57,59,70,76,77,80,84,86,93,70,95,77]
["Port Alberni",291,255,190,127,79,55,26,38,49,204,317,276]
["Port Hardy",247,160,160,125,79,81,54,73,110,257,312,251]
["Port Hawkesbury",121,116,113,106,98,97,96,82,117,157,147,134]
["Port Renfrew",556,377,362,259,155,108,51,82,124,371,580,481]
["Port Saunders",127,93,79,57,79,105,107,99,115,97,82,107]
["Portage La Prairie",23,15,26,25,43,82,80,74,57,46,29,26]
["Powell River",159,109,111,83,77,68,37,45,55,126,178,158]
["Prince Albert",16,12,18,27,45,69,77,62,43,26,17,17]
["Prince George",54,29,27,33,42,61,59,46,54,60,48,44]
["Prince Rupert",328,221,235,211,160,127,127,177,297,432,375,371]
["Pugwash",88,65,77,82,95,82,73,78,98,104,100,96]
["Qu'Appelle Valley",16,11,23,27,61,83,75,58,38,26,18,19]
["Québec City",87,75,76,84,107,111,125,104,116,98,102,100]
["Radisson",31,22,29,33,39,65,79,91,111,87,68,43]
["Red Deer",22,13,21,21,56,89,97,63,51,21,18,14]
["Red Lake",27,17,28,34,73,99,103,88,83,60,43,30]
["Regina",15,9,20,24,51,71,67,45,33,25,14,16]
["Revelstoke",108,80,62,67,58,75,72,67,55,84,118,104]
["Rimouski",71,65,60,65,85,85,91,86,88,92,84,88]
["Roberval",54,44,52,63,74,83,106,86,84,71,84,64]
["Rocky Harbour",136,106,87,69,74,118,80,117,105,123,120,137]
["Rocky Mountain House",19,15,18,24,65,87,115,67,74,26,17,16]
["Sable Island",145,113,130,115,101,116,101,122,130,145,151,145]
["Sackville",103,75,93,89,108,94,87,82,107,106,108,95]
["Saguenay",58,51,52,62,81,88,112,91,103,85,78,70]
["Saint John",124,91,108,105,110,101,88,82,106,116,134,130]
["Saint Leonard",91,68,78,77,87,98,119,101,95,100,98,91]
["Saltspring Island",162,99,89,57,43,37,23,28,33,94,168,154]
["Sandspit, Haida Gwaii",191,131,117,98,66,52,48,62,83,170,194,196]
["Sarnia",52,51,57,72,80,83,78,79,105,76,82,64]
["Saskatoon",13,10,13,23,43,63,67,49,39,19,13,14]
["Sault Ste Marie",64,43,56,65,66,74,72,83,102,102,92,77]
["Schefferville",50,30,50,56,50,75,96,83,115,75,64,48]
["Selkirk",14,9,23,22,60,96,87,81,55,39,20,14]
["Sept-Iles",82,69,81,92,87,99,104,84,109,104,109,99]
["Sherbrooke",74,62,71,84,94,108,110,126,95,90,99,87]
["Sidney",143,89,78,48,38,31,18,24,31,88,153,142]
["Slave Lake",16,10,16,22,43,78,71,60,42,25,16,12]
["Smithers",43,23,21,24,38,55,46,44,54,65,55,42]
["Sorel - Tracy",74,62,61,78,86,97,99,96,81,95,92,80]
["South Baymouth",78,50,64,69,72,59,51,74,95,112,92,94]
["Sparwood",54,41,44,41,60,69,47,35,47,49,72,53]
["Springdale",79,65,57,61,73,100,92,106,90,88,70,71]
["St Anthony",114,95,98,82,83,123,106,108,120,125,116,138]
["St Catharines",65,55,62,77,77,86,78,70,91,67,82,71]
["St Donat",95,77,67,75,99,106,97,110,108,105,102,89]
["St Hyacinthe",76,61,61,80,89,102,104,104,83,102,98,95]
["St Jerome",74,59,64,92,93,114,98,88,99,98,103,67]
["St John's",149,130,142,123,103,98,92,100,130,156,148,165]
["St Lawrence",145,141,126,122,125,146,115,94,172,157,158,142]
["St Shotts",138,114,129,115,111,139,137,113,127,143,146,140]
["Stanhope",123,91,79,88,107,87,63,95,93,102,123,133]
["Ste-Agathe-des-Monts",82,83,75,81,91,107,81,113,95,103,116,100]
["Ste-Anne-des-Monts",61,45,59,54,74,80,92,81,78,92,81,66]
["Steinbach",22,14,22,31,69,100,93,74,57,46,28,24]
["Stephenville",125,105,86,78,97,104,118,130,128,127,118,123]
["Stillwater - Sherbrooke",131,115,130,112,119,113,96,110,138,139,165,156]
["Sudbury",62,51,60,66,83,80,77,85,101,91,78,67]
["Summerside",96,75,79,84,98,91,74,93,97,88,98,100]
["Sussex",109,85,115,90,103,88,84,74,100,106,110,106]
["Swan River",22,16,24,35,54,85,96,77,53,34,25,24]
["Swift Current",17,12,19,19,51,77,60,47,36,19,16,19]
["Sydney",153,128,130,133,103,97,88,100,119,143,156,167]
["Taber",17,14,24,32,48,91,29,39,37,19,17,15]
["Tadoussac",70,59,62,77,93,86,115,103,85,87,82,63]
["Terra Nova National Park",111,118,103,91,82,103,98,88,119,105,97,116]
["The Pas",17,13,18,24,40,66,69,67,57,38,21,20]
["Thetford Mines",108,87,89,88,105,130,133,135,100,112,105,117]
["Thompson",19,16,23,29,47,68,81,71,62,37,33,23]
["Thunder Bay",26,20,31,53,67,84,87,89,73,64,53,35]
["Tignish",113,82,74,77,93,88,89,88,78,99,116,109]
["Timmins",52,41,55,56,67,83,91,82,85,82,76,64]
["Tofino",487,336,330,270,153,130,71,88,133,342,492,440]
["Toronto",62,55,54,68,82,71,64,81,85,64,84,61]
["Trois-Rivières",83,69,76,79,96,107,117,101,101,98,102,93]
["Truro",115,90,104,85,94,93,85,80,103,105,115,114]
["Turtle Mountain Park",19,15,25,26,61,86,82,67,41,37,24,21]
["Upsalquitch Lake",86,49,85,88,101,104,131,106,101,107,74,69]
["Val-D'or",52,39,59,66,85,90,97,93,95,84,84,60]
["Vancouver",223,111,125,102,75,68,43,48,59,157,238,207]
["Vernon",33,25,29,32,42,49,42,28,37,27,44,38]
["Victoria",103,74,50,39,36,27,17,22,25,74,138,102]
["Victoria",98,71,97,80,91,76,73,57,95,89,89,99]
["Wabush Lake",49,40,54,49,53,83,114,103,97,76,71,50]
["Waterloo",65,55,61,75,82,82,99,84,88,67,87,71]
["Waterton Village",52,32,38,52,70,115,19,41,58,41,47,30]
["Wawa",56,47,54,67,78,82,96,93,122,118,86,73]
["Weyburn",20,12,22,28,57,75,66,47,33,24,18,21]
["Whistler",176,105,98,76,67,59,45,47,55,155,192,154]
["Wiggins Point",99,71,84,89,108,89,80,89,80,94,112,92]
["Williams Lake",33,19,18,22,39,59,53,46,42,41,42,38]
["Windsor",62,62,70,83,89,86,89,73,94,73,80,74]
["Winnipeg",20,14,24,30,57,90,80,77,46,38,25,21]
["Woodstock",104,72,91,80,94,91,100,101,96,95,103,103]
["Yarmouth",127,102,116,101,101,95,88,84,95,112,139,132]
["Yorkton",16,11,20,22,51,80,78,62,45,27,16,21]

{"sheet":"Rainfall Data (2)","index":2,"n_rows":271,"n_cols":13,"rows_kept":271,"cut":false,"hidden":true,"merged":[[1,0,1,1]]}
[]
[]
["Place","JAN","FEB","MAR","APR","MAY","JUN","JUL","AUG","SEPT","OCT","NOV","DEC"]
["Abbotsford",212,132,149,118,100,75,43,46,75,153,248,187]
["Atlin",46,25,17,9,18,30,33,34,42,37,36,36]
["Barkerville",96,61,66,58,78,102,100,81,82,92,111,95]
["Bella Coola",157,88,76,56,48,51,42,60,90,195,205,131]
["Campbell River",217,149,140,92,68,63,39,45,55,162,232,226]
["Castlegar",76,51,63,59,70,72,48,30,42,51,97,90]
["Chilliwack",233,126,155,116,93,92,48,57,75,178,284,210]
["Cortes Island, Whaletown",184,131,107,100,73,70,49,55,61,155,224,181]
["Courtenay - Comox",172,114,106,65,46,43,27,29,42,123,201,188]
["Cranbrook",26,19,22,25,46,62,38,28,31,20,35,33]
["Duncan",277,146,154,81,56,41,23,35,41,153,247,254]
["Fort Nelson",21,15,19,19,49,63,78,71,40,33,26,18]
["Fort St John",25,19,24,20,38,66,75,51,45,31,29,22]
["Gabriola Island",147,96,92,63,48,43,24,27,34,86,157,141]
["Gibsons",183,110,125,104,91,67,41,49,60,152,213,174]
["Gold River",424,286,266,187,120,91,56,71,109,359,491,391]
["Golden",46,24,24,24,34,50,51,45,38,35,51,44]
["Kamloops",21,12,13,14,27,37,31,24,29,19,23,25]
["Kelowna",30,20,21,24,31,40,33,26,27,24,35,32]
["Lillooet",38,20,17,19,26,24,36,26,24,34,44,42]
["Mayne Island, Village Bay",130,88,75,55,44,37,21,24,28,80,135,125]
["Nanaimo",188,126,113,67,54,43,25,28,36,102,197,184]
["North Vancouver, Capilano",330,279,218,207,132,124,61,72,98,248,437,316]
["Penticton",27,20,24,26,39,46,29,28,25,26,28,29]
["Port Alberni",291,255,190,127,79,55,26,38,49,204,317,276]
["Port Hardy",247,160,160,125,79,81,54,73,110,257,312,251]
["Port Renfrew",556,377,362,259,155,108,51,82,124,371,580,481]
["Powell River",159,109,111,83,77,68,37,45,55,126,178,158]
["Prince George",54,29,27,33,42,61,59,46,54,60,48,44]
["Prince Rupert",328,221,235,211,160,127,127,177,297,432,375,371]
["Revelstoke",108,80,62,67,58,75,72,67,55,84,118,104]
["Saltspring Island",162,99,89,57,43,37,23,28,33,94,168,154]
["Sandspit, Haida Gwaii",191,131,117,98,66,52,48,62,83,170,194,196]
["Sidney",143,89,78,48,38,31,18,24,31,88,153,142]
["Smithers",43,23,21,24,38,55,46,44,54,65,55,42]
["Sparwood",54,41,44,41,60,69,47,35,47,49,72,53]
["Tofino",487,336,330,270,153,130,71,88,133,342,492,440]
["Vancouver",223,111,125,102,75,68,43,48,59,157,238,207]
["Vernon",33,25,29,32,42,49,42,28,37,27,44,38]
["Victoria",103,74,50,39,36,27,17,22,25,74,138,102]
["Whistler",176,105,98,76,67,59,45,47,55,155,192,154]
["Williams Lake",33,19,18,22,39,59,53,46,42,41,42,38]
["Brooks",13,9,19,22,35,74,26,38,29,11,13,12]
["Cardston",21,19,37,41,81,91,45,44,53,32,30,21]
["Lethbridge",13,12,23,28,50,82,43,37,41,20,18,13]
["Medicine Hat",13,8,19,20,44,65,36,34,37,19,15,12]
["Taber",17,14,24,32,48,91,29,39,37,19,17,15]
["Waterton Village",52,32,38,52,70,115,19,41,58,41,47,30]
["Banff",20,17,21,34,62,68,68,62,39,32,26,21]
["Calgary",9,9,18,25,57,94,66,57,45,15,13,10]
["Camrose",23,14,23,29,41,74,86,52,40,24,19,15]
["Edmonton",22,12,16,29,46,77,94,62,43,22,18,15]
["Edson",27,12,18,23,54,94,108,75,64,25,20,18]
["Jasper",23,14,17,20,31,51,64,64,34,30,24,20]
["Lloydminster",16,10,14,26,45,71,75,60,42,18,18,14]
["Red Deer",22,13,21,21,56,89,97,63,51,21,18,14]
["Rocky Mountain House",19,15,18,24,65,87,115,67,74,26,17,16]
["Cold Lake",16,11,17,31,41,73,79,57,39,20,19,18]
["Fort Chipewyan",15,14,16,16,27,44,67,50,44,29,24,18]
["Fort McMurray",18,13,17,21,36,73,81,57,40,26,20,16]
["Grande Prairie",30,16,17,20,41,76,76,56,43,26,25,19]
["High Level",20,18,18,15,36,51,66,43,32,31,25,19]
["Slave Lake",16,10,16,22,43,78,71,60,42,25,16,12]
["Emerson",27,21,25,29,58,90,94,74,57,47,37,33]
["Gimli",20,14,31,28,42,104,78,57,58,47,28,20]
["Hodgson",36,23,35,29,62,87,69,67,59,47,37,43]
["Morden",19,19,22,35,58,93,79,71,45,50,30,20]
["Portage La Prairie",23,15,26,25,43,82,80,74,57,46,29,26]
["Selkirk",14,9,23,22,60,96,87,81,55,39,20,14]
["Steinbach",22,14,22,31,69,100,93,74,57,46,28,24]
["Winnipeg",20,14,24,30,57,90,80,77,46,38,25,21]
["Brandon",18,13,25,26,59,81,73,66,44,30,19,21]
["Dauphin",14,11,24,30,55,82,73,61,58,35,21,19]
["McCreary",21,18,34,30,63,88,74,62,58,43,26,23]
["Swan River",22,16,24,35,54,85,96,77,53,34,25,24]
["Turtle Mountain Park",19,15,25,26,61,86,82,67,41,37,24,21]
["Churchill",19,17,18,24,30,44,60,69,70,48,35,18]
["Cross Lake",16,18,16,19,42,68,77,70,60,34,25,23]
["Flin Flon",18,15,19,28,41,67,83,67,64,38,26,22]
["Gillam",20,19,23,22,43,56,79,76,57,42,38,23]
["Grand Rapids",18,13,21,26,52,77,71,66,59,38,26,22]
["Lynn Lake",20,16,20,24,37,62,85,69,61,38,27,19]
["Norway House",21,23,24,25,50,70,80,75,61,47,29,27]
["The Pas",17,13,18,24,40,66,69,67,57,38,21,20]
["Thompson",19,16,23,29,47,68,81,71,62,37,33,23]
["Fredericton",95,73,93,86,96,82,88,86,88,89,106,95]
["Mactaquac Provincial Park",101,64,90,86,100,87,98,85,92,97,101,99]
["Saint John",124,91,108,105,110,101,88,82,106,116,134,130]
["Saint Leonard",91,68,78,77,87,98,119,101,95,100,98,91]
["Sussex",109,85,115,90,103,88,84,74,100,106,110,106]
["Wiggins Point",99,71,84,89,108,89,80,89,80,94,112,92]
["Woodstock",104,72,91,80,94,91,100,101,96,95,103,103]
["Buctouche",104,88,93,86,101,95,99,85,86,95,103,101]
["Doaktown",106,77,90,83,113,95,106,94,100,101,112,97]
["Fundy National Park",145,108,146,121,127,110,99,94,123,133,159,147]
["Kouchibouguac National Park",138,99,123,107,112,91,110,87,84,100,121,125]
["Moncton",98,84,106,92,102,88,85,77,94,106,94,100]
["Sackville",103,75,93,89,108,94,87,82,107,106,108,95]
["Bathurst",98,68,73,91,77,92,96,118,72,84,107,95]
["Dalhousie",84,67,77,72,85,85,102,90,79,84,92,80]
["Kedgwick",72,59,50,61,84,106,122,103,86,95,80,73]
["Miramichi",87,71,91,85,99,86,100,93,84,90,101,85]
["Mount Carleton Provincial Park",99,68,77,76,93,105,119,104,97,95,97,91]
["Upsalquitch Lake",86,49,85,88,101,104,131,106,101,107,74,69]
["Come By Chance",130,117,109,96,95,132,93,89,118,131,120,110]
["Harbour Grace",124,124,115,94,85,121,89,89,135,138,112,103]
["Long Harbour",130,118,116,112,92,121,102,97,126,135,127,117]
["St John's",149,130,142,123,103,98,92,100,130,156,148,165]
["St Shotts",138,114,129,115,111,139,137,113,127,143,146,140]
["Bonavista",101,104,103,83,76,90,82,79,108,115,105,107]
["St Lawrence",145,141,126,122,125,146,115,94,172,157,158,142]
["Terra Nova National Park",111,118,103,91,82,103,98,88,119,105,97,116]
["Baie Verte",104,87,75,74,79,108,86,115,92,112,88,96]
["Burgeo",156,124,110,138,127,155,138,129,144,155,164,146]
["Gander",112,105,113,95,90,88,95,104,115,114,113,127]
["Grand Falls",94,94,91,84,78,89,89,107,96,94,94,90]
["Harbour Breton",112,120,102,125,117,138,119,93,140,147,150,121]
["Musgrave Harbour",88,82,76,74,73,75,82,93,110,100,93,98]
["Springdale",79,65,57,61,73,100,92,106,90,88,70,71]
["Channel-Port-Aux-Basques",152,125,108,139,119,127,113,119,125,145,151,172]
["Corner Brook",145,106,93,80,86,87,92,107,106,112,122,149]
["Deer Lake",114,84,73,70,77,81,95,110,100,89,91,111]
["Gros Morne National Park",237,138,93,81,85,123,96,133,127,159,156,200]
["Port Saunders",127,93,79,57,79,105,107,99,115,97,82,107]
["Rocky Harbour",136,106,87,69,74,118,80,117,105,123,120,137]
["St Anthony",114,95,98,82,83,123,106,108,120,125,116,138]
["Stephenville",125,105,86,78,97,104,118,130,128,127,118,123]
["Cartwright",86,91,92,75,68,99,101,94,89,102,85,92]
["Churchill Falls",53,44,55,64,61,80,112,93,111,82,78,54]
["Happy Valley - Goose Bay",65,57,65,64,69,91,121,99,91,81,72,64]
["Makkovik",73,75,73,62,52,94,101,98,92,92,84,84]
["Mary's Harbour",69,81,67,51,73,95,86,89,68,93,84,87]
["Nain",84,71,74,71,57,83,99,71,82,74,78,82]
["Wabush Lake",49,40,54,49,53,83,114,103,97,76,71,50]
["Baddeck",155,126,129,126,104,105,97,107,128,137,155,166]
["Cheticamp",143,108,103,88,85,96,90,114,124,130,141,153]
["Ingonish Beach",186,140,154,169,109,91,93,114,144,176,190,188]
["Louisbourg",147,138,144,148,128,113,108,108,133,158,169,153]
["Port Hawkesbury",121,116,113,106,98,97,96,82,117,157,147,134]
["Sydney",153,128,130,133,103,97,88,100,119,143,156,167]
["Pictou",110,95,100,94,84,90,77,81,118,129,135,121]
["Pugwash",88,65,77,82,95,82,73,78,98,104,100,96]
["Sable Island",145,113,130,115,101,116,101,122,130,145,151,145]
["Stillwater - Sherbrooke",131,115,130,112,119,113,96,110,138,139,165,156]
["Bridgewater",144,120,156,127,128,104,97,100,111,137,165,148]
["Halifax",140,110,132,118,119,112,110,96,109,124,151,145]
["Liverpool - Milton",159,137,165,146,136,109,98,89,122,128,180,176]
["Yarmouth",127,102,116,101,101,95,88,84,95,112,139,132]
["Amherst - Nappan",106,83,105,92,101,83,89,74,102,103,111,107]
["Annapolis Royal",114,85,94,95,86,74,69,69,110,120,125,113]
["Kejimkujik National Park",136,102,125,124,99,102,98,90,83,97,152,140]
["Kentville",116,101,110,93,102,82,84,77,84,89,122,122]
["Parrsboro",115,89,115,104,105,102,90,86,113,109,120,122]
["Truro",115,90,104,85,94,93,85,80,103,105,115,114]
["Belleville",67,58,62,76,81,74,65,75,92,85,96,79]
["Cornwall",76,60,62,81,88,97,99,89,98,93,92,76]
["Kingston",65,65,69,87,77,72,64,94,90,92,100,84]
["Ottawa",63,50,57,71,87,93,84,84,93,86,83,70]
["Pembroke",48,42,56,60,76,70,75,83,84,77,69,59]
["Barrie",83,62,58,62,82,85,77,90,94,78,89,74]
["Brantford",55,51,59,69,81,76,95,75,87,70,84,65]
["French River, Chaudiere Dam",75,61,59,67,90,74,80,79,106,100,87,80]
["Hamilton",57,57,64,73,85,73,83,90,81,72,91,72]
["Huntsville",93,72,68,61,89,78,83,81,111,105,99,94]
["Midland",103,64,56,70,84,81,78,78,95,94,104,95]
["Niagara Falls",64,64,68,75,83,85,84,78,88,84,102,87]
["Oshawa",66,57,54,73,79,74,73,77,94,70,85,71]
["Peterborough",55,61,54,70,83,73,61,96,84,77,83,74]
["St Catharines",65,55,62,77,77,86,78,70,91,67,82,71]
["Toronto",62,55,54,68,82,71,64,81,85,64,84,61]
["Chatham-Kent",63,54,60,80,80,78,85,79,89,71,77,67]
["Guelph",52,58,67,74,80,79,96,93,90,72,91,81]
["London",74,65,72,83,90,92,83,83,103,81,98,87]
["Owen Sound",129,86,78,71,84,73,70,79,106,98,110,130]
["Point Pelee National Park",57,59,70,76,77,80,84,86,93,70,95,77]
["Sarnia",52,51,57,72,80,83,78,79,105,76,82,64]
["Waterloo",65,55,61,75,82,82,99,84,88,67,87,71]
["Windsor",62,62,70,83,89,86,89,73,94,73,80,74]
["Chapleau",52,43,47,53,70,80,82,76,95,83,64,64]
["Gore Bay",45,30,63,67,61,65,48,65,88,107,94,70]
["Kapuskasing",48,36,48,55,69,80,102,77,101,86,71,56]
["Moosonee",33,29,35,38,55,72,97,78,95,75,56,42]
["North Bay",69,57,65,72,96,98,99,91,115,107,98,78]
["Sault Ste Marie",64,43,56,65,66,74,72,83,102,102,92,77]
["South Baymouth",78,50,64,69,72,59,51,74,95,112,92,94]
["Sudbury",62,51,60,66,83,80,77,85,101,91,78,67]
["Timmins",52,41,55,56,67,83,91,82,85,82,76,64]
["Wawa",56,47,54,67,78,82,96,93,122,118,86,73]
["Atikokan",35,25,33,50,77,104,118,88,100,76,45,36]
["Big Trout Lake",22,19,31,33,40,80,85,89,90,50,55,28]
["Dryden",27,20,30,40,73,115,103,84,89,64,47,29]
["Fort Frances",35,22,26,41,78,119,97,92,83,57,46,32]
["Kenora",26,19,28,36,81,119,103,84,86,63,42,28]
["Red Lake",27,17,28,34,73,99,103,88,83,60,43,30]
["Thunder Bay",26,20,31,53,67,84,87,89,73,64,53,35]
["Alberton",96,74,81,80,93,82,86,80,92,96,99,94]
["O'Leary",99,82,89,86,103,85,96,88,102,100,112,107]
["Summerside",96,75,79,84,98,91,74,93,97,88,98,100]
["Tignish",113,82,74,77,93,88,89,88,78,99,116,109]
["Charlottetown",101,83,86,84,91,99,80,96,96,112,113,118]
["Long River",84,64,69,75,98,92,82,91,101,103,105,93]
["New Glasgow",120,87,96,97,102,98,79,88,107,123,129,133]
["Stanhope",123,91,79,88,107,87,63,95,93,102,123,133]
["Victoria",98,71,97,80,91,76,73,57,95,89,89,99]
["Alliston",93,79,75,96,83,94,89,75,128,127,123,117]
["Baltic",116,91,96,93,93,101,87,104,115,122,126,129]
["Bangor",120,99,99,94,96,94,82,96,112,120,129,141]
["Monticello",101,82,87,87,90,91,79,89,108,115,124,118]
["Drummondville",86,72,70,80,94,102,106,106,95,102,104,98]
["Granby",97,73,87,90,97,116,118,123,105,103,105,102]
["Montréal",77,63,69,82,81,87,89,94,83,91,96,87]
["Sherbrooke",74,62,71,84,94,108,110,126,95,90,99,87]
["Sorel - Tracy",74,62,61,78,86,97,99,96,81,95,92,80]
["St Hyacinthe",76,61,61,80,89,102,104,104,83,102,98,95]
["Thetford Mines",108,87,89,88,105,130,133,135,100,112,105,117]
["Joliette",78,61,66,83,84,107,90,90,95,92,96,78]
["La Tuque",58,46,55,55,84,94,130,94,95,82,74,53]
["Québec City",87,75,76,84,107,111,125,104,116,98,102,100]
["Roberval",54,44,52,63,74,83,106,86,84,71,84,64]
["Saguenay",58,51,52,62,81,88,112,91,103,85,78,70]
["Trois-Rivières",83,69,76,79,96,107,117,101,101,98,102,93]
["Amos",56,36,50,65,87,94,112,98,107,87,79,58]
["Lachute",91,70,73,88,96,115,100,104,108,110,106,90]
["Maniwaki",55,52,66,65,85,83,79,111,77,93,82,64]
["Mont Laurier",69,54,62,71,90,93,101,100,93,98,89,77]
["St Donat",95,77,67,75,99,106,97,110,108,105,102,89]
["St Jerome",74,59,64,92,93,114,98,88,99,98,103,67]
["Ste-Agathe-des-Monts",82,83,75,81,91,107,81,113,95,103,116,100]
["Val-D'or",52,39,59,66,85,90,97,93,95,84,84,60]
["Caplan",80,56,60,64,92,87,100,95,79,88,86,70]
["Gaspé",88,65,98,90,89,80,100,94,82,121,111,117]
["Iles de la Madeleine",97,74,76,74,86,76,76,85,96,94,109,94]
["Rimouski",71,65,60,65,85,85,91,86,88,92,84,88]
["Ste-Anne-des-Monts",61,45,59,54,74,80,92,81,78,92,81,66]
["Baie-Comeau",83,65,68,80,91,89,93,75,86,95,96,79]
["Blanc-Sablon",97,84,80,50,69,92,102,96,89,88,75,100]
["Fermont",48,31,43,41,47,79,118,101,104,63,58,51]
["Natashquan",91,70,90,80,86,88,105,92,95,104,103,94]
["Schefferville",50,30,50,56,50,75,96,83,115,75,64,48]
["Sept-Iles",82,69,81,92,87,99,104,84,109,104,109,99]
["Tadoussac",70,59,62,77,93,86,115,103,85,87,82,63]
["Inukjuak",14,13,17,22,29,41,53,58,82,57,46,27]
["Kuujjuaq",32,29,32,27,29,50,60,71,74,55,48,36]
["Kuujjuarapik",28,23,23,24,33,60,76,92,109,82,66,46]
["Radisson",31,22,29,33,39,65,79,91,111,87,68,43]
["Cypress Hills",28,22,35,46,62,122,40,39,49,26,21,31]
["Estevan",18,14,22,24,56,75,67,52,36,28,17,17]
["Moose Jaw",17,11,20,18,48,59,63,39,38,20,17,17]
["Moosomin",21,15,26,24,66,90,78,64,56,35,20,19]
["Qu'Appelle Valley",16,11,23,27,61,83,75,58,38,26,18,19]
["Regina",15,9,20,24,51,71,67,45,33,25,14,16]
["Swift Current",17,12,19,19,51,77,60,47,36,19,16,19]
["Weyburn",20,12,22,28,57,75,66,47,33,24,18,21]
["Good Spirit Lake",15,13,24,26,60,86,78,66,47,27,19,22]
["Kindersley",11,7,12,23,40,67,56,44,29,13,11,12]
["Last Mountain Lake",17,10,18,26,43,75,54,51,33,21,15,18]
["Lloydminster",21,14,20,31,38,63,71,50,33,18,29,24]
["Melfort",15,10,17,27,43,54,77,52,39,28,17,18]
["North Battleford",16,10,14,26,33,65,74,58,34,16,16,14]
["Saskatoon",13,10,13,23,43,63,67,49,39,19,13,14]
["Yorkton",16,11,20,22,51,80,78,62,45,27,16,21]
["Buffalo Narrows",21,19,17,26,40,62,80,62,44,32,25,22]
["Collins Bay",21,21,27,22,49,50,77,92,60,47,36,26]
["Cree Lake",18,16,16,24,31,67,84,67,45,35,29,17]
["La Ronge",19,15,21,36,44,67,81,61,56,37,28,23]
["Meadow Lake",16,10,14,25,44,66,75,63,41,23,19,18]
["Nipawin",15,12,15,25,43,74,83,57,41,28,16,18]
["Prince Albert",16,12,18,27,45,69,77,62,43,26,17,17]