{"text_format":"1","workbook":"xlsx","n_sheets":3,"sheets":["RAIN-TANK 2017","Rainfall Data","Rainfall Data (2)"],"not_rendered":{"charts":0,"images":4,"macros":1,"external_links":0,"defined_names":18,"comments":0,"pivot_tables":0},"unopened":[],"bounds":{"document_bytes":16777216,"sheet_cells":100000,"rows_first":2000,"rows_last":500,"rows_between":2000,"halvings":0,"cell_chars":16384,"cell_head_chars":4096},"cells_cut":0,"cells_raw":0,"read":"whole","date_system":"1900"}

{"sheet":"RAIN-TANK 2017","index":0,"n_rows":51,"n_cols":26,"rows_kept":51,"cut":false,"hidden":false,"merged":[[4,2,4,14],[3,9,3,10],[1,7,1,8],[2,7,2,8],[23,2,23,14]]}
[]
[null,"RAINWATER HARVESTING STORAGE WORKSHEET ",null,null,null,null,null,"WEATHER STATION:",null,null,"Friday Harbor, San Juan Island",null,null,null,null,null,null,null,"Country"]
[null,"Optimize your storage volume ",null,null,null,null,null,"PROJECT NAME:",null,"Test",null,null,null,null,null,null,null,null,"Aberdeen",{"$f":"--ISNUMBER(IFERROR(SEARCH($K$2,S3,1),\"\"))","v":0},{"$f":"IF(T3=1,COUNTIF($T$3:T3,1),\"\")","v":""},{"$f":"IFERROR(INDEX($S$3:$S$21,MATCH(ROWS($U$3:U3),$U$3:$U$21,0)),\"\")","v":"Friday Harbor, San Juan Island"},{"$f":"IFERROR(INDEX($S$3:$S$21,MATCH(ROWS($U$3:V3),$U$3:$U$21,0)),\"\")","v":"Friday Harbor, San Juan Island"},{"$f":"IFERROR(INDEX($S$3:$S$21,MATCH(ROWS($U$3:U3),$U$3:$U$21,0)),\"\")","v":"Friday Harbor, San Juan Island"},null,{"$f":"$V$3:INDEX($V$3:$V$21,MAX($U$3:$U$21),1)","v":"Friday Harbor, San Juan Island"}]
[null,null,null,null,null,null,null,"DATE:",null,"2017-07-21",null,null,null,null,null,null,null,null,"Clearwater",{"$f":"--ISNUMBER(IFERROR(SEARCH($K$2,S4,1),\"\"))","v":0},{"$f":"IF(T4=1,COUNTIF($T$3:T4,1),\"\")","v":""},{"$f":"IFERROR(INDEX($S$3:$S$21,MATCH(ROWS($U$3:U4),$U$3:$U$21,0)),\"\")","v":""},{"$f":"IFERROR(INDEX($S$3:$S$21,MATCH(ROWS($U$3:V4),$U$3:$U$21,0)),\"\")","v":""},{"$f":"IFERROR(INDEX($S$3:$S$21,MATCH(ROWS($U$3:U4),$U$3:$U$21,0)),\"\")","v":""},null,{"$f":"$V$3:INDEX($V$3:$V$21,MAX($U$3:$U$21),1)","v":"Friday Harbor, San Juan Island"}]
[null,null,"INPUTS",null,null,null,null,null,null,null,null,null,null,null,null,null,null,null,"Forks",0,{"$f":"IF(T5=1,COUNTIF($T$3:T5,1),\"\")","v":""},{"$f":"IFERROR(INDEX($S$3:$S$21,MATCH(ROWS($U$3:U5),$U$3:$U$21,0)),\"\")","v":""},{"$f":"IFERROR(INDEX($S$3:$S$21,MATCH(ROWS($U$3:V5),$U$3:$U$21,0)),\"\")","v":""},{"$f":"IFERROR(INDEX($S$3:$S$21,MATCH(ROWS($U$3:U5),$U$3:$U$21,0)),\"\")","v":""},null,{"$f":"$V$3:INDEX($V$3:$V$21,MAX($U$3:$U$21),1)","v":"Friday Harbor, San Juan Island"}]
[null,null,null,null,null,null,null,null,null,null,null,null,null,null,null,null,null,null,"Friday Harbor, San Juan Island",1,{"$f":"IF(T6=1,COUNTIF($T$3:T6,1),\"\")","v":1},{"$f":"IFERROR(INDEX($S$3:$S$21,MATCH(ROWS($U$3:U6),$U$3:$U$21,0)),\"\")","v":""},{"$f":"IFERROR(INDEX($S$3:$S$21,MATCH(ROWS($U$3:V6),$U$3:$U$21,0)),\"\")","v":""},{"$f":"IFERROR(INDEX($S$3:$S$21,MATCH(ROWS($U$3:U6),$U$3:$U$21,0)),\"\")","v":""},null,{"$f":"$V$3:INDEX($V$3:$V$21,MAX($U$3:$U$21),1)","v":"Friday Harbor, San Juan Island"}]
[null,"MONTH","JAN","FEB","MAR","APR","MAY","JUN","JUL","AUG","SEPT","OCT","NOV","DEC","TOTAL","Column1",null,null,"Grayland",0,{"$f":"IF(T7=1,COUNTIF($T$3:T7,1),\"\")","v":""},{"$f":"IFERROR(INDEX($S$3:$S$21,MATCH(ROWS($U$3:U7),$U$3:$U$21,0)),\"\")","v":""},{"$f":"IFERROR(INDEX($S$3:$S$21,MATCH(ROWS($U$3:V7),$U$3:$U$21,0)),\"\")","v":""},{"$f":"IFERROR(INDEX($S$3:$S$21,MATCH(ROWS($U$3:U7),$U$3:$U$21,0)),\"\")","v":""},null,{"$f":"$V$3:INDEX($V$3:$V$21,MAX($U$3:$U$21),1)","v":"Friday Harbor, San Juan Island"}]
[null,"Washington State Precipitation (Inches)                             ",{"$f":"VLOOKUP($K$2,'Rainfall Data'!$A$4:$O$40,2,FALSE)","v":4.2},{"$f":"VLOOKUP($K$2,'Rainfall Data'!$A$4:$O$40,3,FALSE)","v":2.1},{"$f":"VLOOKUP($K$2,'Rainfall Data'!$A$4:$O$40,4,FALSE)","v":2},{"$f":"VLOOKUP($K$2,'Rainfall Data'!$A$4:$O$40,5,FALSE)","v":1.6},{"$f":"VLOOKUP($K$2,'Rainfall Data'!$A$4:$O$40,6,FALSE)","v":1.5},{"$f":"VLOOKUP($K$2,'Rainfall Data'!$A$4:$O$40,7,FALSE)","v":1.1000000000000001},{"$f":"VLOOKUP($K$2,'Rainfall Data'!$A$4:$O$40,8,FALSE)","v":0.8},{"$f":"VLOOKUP($K$2,'Rainfall Data'!$A$4:$O$40,9,FALSE)","v":0.9},{"$f":"VLOOKUP($K$2,'Rainfall Data'!$A$4:$O$40,10,FALSE)","v":1.4},{"$f":"VLOOKUP($K$2,'Rainfall Data'!$A$4:$O$40,11,FALSE)","v":2.7},{"$f":"VLOOKUP($K$2,'Rainfall Data'!$A$4:$O$40,12,FALSE)","v":4},{"$f":"VLOOKUP($K$2,'Rainfall Data'!$A$4:$O$40,13,FALSE)","v":2.8},{"$f":"SUM(CheckList1[[#This Row],[JAN]:[DEC]])","v":25.1},null,null,null,"Long Beach",0,{"$f":"IF(T8=1,COUNTIF($T$3:T8,1),\"\")","v":""},{"$f":"IFERROR(INDEX($S$3:$S$21,MATCH(ROWS($U$3:U8),$U$3:$U$21,0)),\"\")","v":""},{"$f":"IFERROR(INDEX($S$3:$S$21,MATCH(ROWS($U$3:V8),$U$3:$U$21,0)),\"\")","v":""},{"$f":"IFERROR(INDEX($S$3:$S$21,MATCH(ROWS($U$3:U8),$U$3:$U$21,0)),\"\")","v":""},null,{"$f":"$V$3:INDEX($V$3:$V$21,MAX($U$3:$U$21),1)","v":"Friday Harbor, San Juan Island"}]
[null,"mm to Inches & inches  to Gallon",{"$f":"C8*(7.49/12)","v":2.6215000000000002},{"$f":"D8*(7.49/12)","v":1.3107500000000001},1.2483333333333333,0.9986666666666667,0.93625000000000003,0.68658333333333332,0.49933333333333335,0.56174999999999997,0.87383333333333324,1.6852500000000001,2.4966666666666666,1.7476666666666665,{"$f":"SUM(CheckList1[[#This Row],[JAN]:[DEC]])","v":15.666583333333332},null,null,null,"Port Angeles",0,{"$f":"IF(T9=1,COUNTIF($T$3:T9,1),\"\")","v":""},{"$f":"IFERROR(INDEX($S$3:$S$21,MATCH(ROWS($U$3:U9),$U$3:$U$21,0)),\"\")","v":""},{"$f":"IFERROR(INDEX($S$3:$S$21,MATCH(ROWS($U$3:V9),$U$3:$U$21,0)),\"\")","v":""},{"$f":"IFERROR(INDEX($S$3:$S$21,MATCH(ROWS($U$3:U9),$U$3:$U$21,0)),\"\")","v":""},null,{"$f":"$V$3:INDEX($V$3:$V$21,MAX($U$3:$U$21),1)","v":"Friday Harbor, San Juan Island"}]
[null,"Precipitation Received from Roof (US gals)",{"$f":"($C$36*C9)*$C$37","v":5898.375},2949.1875,2808.75,2247.0000000000005,2106.5625,1544.8125,1123.5000000000002,1263.9375,1966.1249999999998,3791.8125,5617.5,3932.2499999999995,{"$f":"SUM(CheckList1[[#This Row],[JAN]:[DEC]])","v":35249.8125},null,null,null,"Anacortes",0,{"$f":"IF(T10=1,COUNTIF($T$3:T10,1),\"\")","v":""},{"$f":"IFERROR(INDEX($S$3:$S$21,MATCH(ROWS($U$3:U10),$U$3:$U$21,0)),\"\")","v":""},{"$f":"IFERROR(INDEX($S$3:$S$21,MATCH(ROWS($U$3:V10),$U$3:$U$21,0)),\"\")","v":""},{"$f":"IFERROR(INDEX($S$3:$S$21,MATCH(ROWS($U$3:U10),$U$3:$U$21,0)),\"\")","v":""},null,{"$f":"$V$3:INDEX($V$3:$V$21,MAX($U$3:$U$21),1)","v":"Friday Harbor, San Juan Island"}]
[null,"Start of Month in Storage (US gals) (Last Dec.)        ",null,{"$f":"IF(C17>0,(C17),(0))","v":3398.375},{"$f":"IF(D17>0,(D17),(0))","v":3847.5625},4156.3125,3903.3125,3509.875,1554.6875,0,0,0,0,3117.5,null,null,null,null,"Bellingham",0,{"$f":"IF(T11=1,COUNTIF($T$3:T11,1),\"\")","v":""},{"$f":"IFERROR(INDEX($S$3:$S$21,MATCH(ROWS($U$3:U11),$U$3:$U$21,0)),\"\")","v":""},{"$f":"IFERROR(INDEX($S$3:$S$21,MATCH(ROWS($U$3:V11),$U$3:$U$21,0)),\"\")","v":""},{"$f":"IFERROR(INDEX($S$3:$S$21,MATCH(ROWS($U$3:U11),$U$3:$U$21,0)),\"\")","v":""},null,{"$f":"$V$3:INDEX($V$3:$V$21,MAX($U$3:$U$21),1)","v":"Friday Harbor, San Juan Island"}]
[null,"Household Usage (US gals)                        ",2500,2500,2500,2500,2500,2500,2500,2500,2500,2500,2500,2500,{"$f":"SUM(CheckList1[[#This Row],[JAN]:[DEC]])","v":30000},null,null,null,"Bremerton",0,{"$f":"IF(T12=1,COUNTIF($T$3:T12,1),\"\")","v":""},{"$f":"IFERROR(INDEX($S$3:$S$21,MATCH(ROWS($U$3:U12),$U$3:$U$21,0)),\"\")","v":""},{"$f":"IFERROR(INDEX($S$3:$S$21,MATCH(ROWS($U$3:V12),$U$3:$U$21,0)),\"\")","v":""},{"$f":"IFERROR(INDEX($S$3:$S$21,MATCH(ROWS($U$3:U12),$U$3:$U$21,0)),\"\")","v":""},null,{"$f":"$V$3:INDEX($V$3:$V$21,MAX($U$3:$U$21),1)","v":"Friday Harbor, San Juan Island"}]
[null,"Irrigation/Outside Usage (US gals)                           ",null,null,null,null,null,1000,2000,2000,2000,1500,null,null,{"$f":"SUM(CheckList1[[#This Row],[JAN]:[DEC]])","v":8500},null,null,null,"Everett",0,{"$f":"IF(T13=1,COUNTIF($T$3:T13,1),\"\")","v":""},{"$f":"IFERROR(INDEX($S$3:$S$21,MATCH(ROWS($U$3:U13),$U$3:$U$21,0)),\"\")","v":""},{"$f":"IFERROR(INDEX($S$3:$S$21,MATCH(ROWS($U$3:V13),$U$3:$U$21,0)),\"\")","v":""},{"$f":"IFERROR(INDEX($S$3:$S$21,MATCH(ROWS($U$3:U13),$U$3:$U$21,0)),\"\")","v":""},null,{"$f":"$V$3:INDEX($V$3:$V$21,MAX($U$3:$U$21),1)","v":"Friday Harbor, San Juan Island"}]
[null,"Total Usage  (US gals)",{"$f":"C13+C12","v":2500},{"$f":"D13+D12","v":2500},2500,2500,2500,3500,4500,4500,4500,4000,2500,2500,{"$f":"SUM(CheckList1[[#This Row],[JAN]:[DEC]])","v":38500},null,null,null,"Longview",0,{"$f":"IF(T14=1,COUNTIF($T$3:T14,1),\"\")","v":""},{"$f":"IFERROR(INDEX($S$3:$S$21,MATCH(ROWS($U$3:U14),$U$3:$U$21,0)),\"\")","v":""},{"$f":"IFERROR(INDEX($S$3:$S$21,MATCH(ROWS($U$3:V14),$U$3:$U$21,0)),\"\")","v":""},{"$f":"IFERROR(INDEX($S$3:$S$21,MATCH(ROWS($U$3:U14),$U$3:$U$21,0)),\"\")","v":""},null,{"$f":"$V$3:INDEX($V$3:$V$21,MAX($U$3:$U$21),1)","v":"Friday Harbor, San Juan Island"}]
[null,"End of Month (no Storage Limit) (imp gals)",{"$f":"C10+C11-C14","v":3398.375},3847.5625,4156.3125,3903.3125,3509.875,1554.6875,-1821.8125,-3236.0625,-2533.875,-208.1875,3117.5,4549.75,null,{"$f":"SUM(CheckList1[[#This Row],[JAN]:[DEC]])","v":20237.4375},null,null,"Olga, Orcas Island",0,{"$f":"IF(T15=1,COUNTIF($T$3:T15,1),\"\")","v":""},{"$f":"IFERROR(INDEX($S$3:$S$21,MATCH(ROWS($U$3:U15),$U$3:$U$21,0)),\"\")","v":""},{"$f":"IFERROR(INDEX($S$3:$S$21,MATCH(ROWS($U$3:V15),$U$3:$U$21,0)),\"\")","v":""},{"$f":"IFERROR(INDEX($S$3:$S$21,MATCH(ROWS($U$3:U15),$U$3:$U$21,0)),\"\")","v":""},null,{"$f":"$V$3:INDEX($V$3:$V$21,MAX($U$3:$U$21),1)","v":"Friday Harbor, San Juan Island"}]
[null,"Overflow Volume - wastage  (imp gals)",{"$f":"C15-C17","v":0},{"$f":"D15-D17","v":0},0,0,0,0,0,0,0,0,0,0,{"$f":"SUM(CheckList1[[#This Row],[JAN]:[DEC]])","v":0}]
[null,"End of Month in Storage (US gals) (make-up)",{"$f":"IF(C15>$C$35,($C$35),(C15))","v":3398.375},3847.5625,4156.3125,3903.3125,3509.875,1554.6875,-1821.8125,-3236.0625,-2533.875,-208.1875,3117.5,4549.75,null,{"$f":"SUM(CheckList1[[#This Row],[JAN]:[DEC]])","v":20237.4375},null,null,"Olympia",0,{"$f":"IF(T17=1,COUNTIF($T$3:T17,1),\"\")","v":""},{"$f":"IFERROR(INDEX($S$3:$S$21,MATCH(ROWS($U$3:U17),$U$3:$U$21,0)),\"\")","v":""},{"$f":"IFERROR(INDEX($S$3:$S$21,MATCH(ROWS($U$3:V17),$U$3:$U$21,0)),\"\")","v":""},{"$f":"IFERROR(INDEX($S$3:$S$21,MATCH(ROWS($U$3:U17),$U$3:$U$21,0)),\"\")","v":""},null,{"$f":"$V$3:INDEX($V$3:$V$21,MAX($U$3:$U$21),1)","v":"Friday Harbor, San Juan Island"}]
[null,"ANNUAL OVERFLOW VOLUME (WASTAGE)",{"$f":"100%-((O10-(P15-P17))/O10)","v":0},null,null,null,null,null,null,null,null,null,null,null,null,null,null,null,"Port Townsend",0,{"$f":"IF(T18=1,COUNTIF($T$3:T18,1),\"\")","v":""},{"$f":"IFERROR(INDEX($S$3:$S$21,MATCH(ROWS($U$3:U18),$U$3:$U$21,0)),\"\")","v":""},{"$f":"IFERROR(INDEX($S$3:$S$21,MATCH(ROWS($U$3:V18),$U$3:$U$21,0)),\"\")","v":""},{"$f":"IFERROR(INDEX($S$3:$S$21,MATCH(ROWS($U$3:U18),$U$3:$U$21,0)),\"\")","v":""},null,{"$f":"$V$3:INDEX($V$3:$V$21,MAX($U$3:$U$21),1)","v":"Friday Harbor, San Juan Island"}]
[null,"ANNUAL MAKE-UP WATER (SHORTFALL) ",{"$f":"(IF(C15<0,($C15),(0))+IF(D15<0,($D15),(0))+IF(E15<0,($E15),(0))+IF(F15<0,($F15),(0))+IF(G15<0,($G15),(0))+IF(H15<0,($H15),(0))+IF(I15<0,($I15),(0))+IF(J15<0,($J15),(0))+IF(K15<0,($K15),(0))+IF(L15<0,($L15),(0))+IF(M15<0,($M15),(0))+IF(N15<0,($N15),(0)))/O14","v":-0.20259577922077923},null,null,null,null,null,null,null,null,null,null,null,null,null,null,null,"Seattle",0,{"$f":"IF(T19=1,COUNTIF($T$3:T19,1),\"\")","v":""},{"$f":"IFERROR(INDEX($S$3:$S$21,MATCH(ROWS($U$3:U19),$U$3:$U$21,0)),\"\")","v":""},{"$f":"IFERROR(INDEX($S$3:$S$21,MATCH(ROWS($U$3:V19),$U$3:$U$21,0)),\"\")","v":""},{"$f":"IFERROR(INDEX($S$3:$S$21,MATCH(ROWS($U$3:U19),$U$3:$U$21,0)),\"\")","v":""},null,{"$f":"$V$3:INDEX($V$3:$V$21,MAX($U$3:$U$21),1)","v":"Friday Harbor, San Juan Island"}]
[null,null,null,null,null,null,null,null,null,null,null,null,null,null,null,null,null,null,"Tacoma",0,{"$f":"IF(T20=1,COUNTIF($T$3:T20,1),\"\")","v":""},{"$f":"IFERROR(INDEX($S$3:$S$21,MATCH(ROWS($U$3:U20),$U$3:$U$21,0)),\"\")","v":""},{"$f":"IFERROR(INDEX($S$3:$S$21,MATCH(ROWS($U$3:V20),$U$3:$U$21,0)),\"\")","v":""},{"$f":"IFERROR(INDEX($S$3:$S$21,MATCH(ROWS($U$3:U20),$U$3:$U$21,0)),\"\")","v":""},null,{"$f":"$V$3:INDEX($V$3:$V$21,MAX($U$3:$U$21),1)","v":"Friday Harbor, San Juan Island"}]
[null,null,null,null,null,null,null,null,null,null,null,null,null,null,null,null,null,null,"Darrington",0,{"$f":"IF(T21=1,COUNTIF($T$3:T21,1),\"\")","v":""},{"$f":"IFERROR(INDEX($S$3:$S$21,MATCH(ROWS($U$3:U21),$U$3:$U$21,0)),\"\")","v":""},{"$f":"IFERROR(INDEX($S$3:$S$21,MATCH(ROWS($U$3:V21),$U$3:$U$21,0)),\"\")","v":""},{"$f":"IFERROR(INDEX($S$3:$S$21,MATCH(ROWS($U$3:U21),$U$3:$U$21,0)),\"\")","v":""},null,{"$f":"$V$3:INDEX($V$3:$V$21,MAX($U$3:$U$21),1)","v":"Friday Harbor, San Juan Island"}]
[null,"Washington State Precipitation (Inches)                             ",{"$f":"VLOOKUP($K$2,'Rainfall Data'!$A$4:$O$40,2,FALSE)","v":4.2},{"$f":"VLOOKUP($K$2,'Rainfall Data'!$A$4:$O$40,3,FALSE)","v":2.1},{"$f":"VLOOKUP($K$2,'Rainfall Data'!$A$4:$O$40,4,FALSE)","v":2},{"$f":"VLOOKUP($K$2,'Rainfall Data'!$A$4:$O$40,5,FALSE)","v":1.6},{"$f":"VLOOKUP($K$2,'Rainfall Data'!$A$4:$O$40,6,FALSE)","v":1.5},{"$f":"VLOOKUP($K$2,'Rainfall Data'!$A$4:$O$40,7,FALSE)","v":1.1000000000000001},{"$f":"VLOOKUP($K$2,'Rainfall Data'!$A$4:$O$40,8,FALSE)","v":0.8},{"$f":"VLOOKUP($K$2,'Rainfall Data'!$A$4:$O$40,9,FALSE)","v":0.9},{"$f":"VLOOKUP($K$2,'Rainfall Data'!$A$4:$O$40,10,FALSE)","v":1.4},{"$f":"VLOOKUP($K$2,'Rainfall Data'!$A$4:$O$40,11,FALSE)","v":2.7},{"$f":"VLOOKUP($K$2,'Rainfall Data'!$A$4:$O$40,12,FALSE)","v":4},{"$f":"VLOOKUP($K$2,'Rainfall Data'!$A$4:$O$40,13,FALSE)","v":2.8},{"$f":"SUM(C22:N22)","v":25.1},null,null,null,"Long Beach",{"$f":"--ISNUMBER(IFERROR(SEARCH($K$2,S22,1),\"\"))","v":0},{"$f":"IF(T22=1,COUNTIF($T$3:T22,1),\"\")","v":""},{"$f":"IFERROR(INDEX($S$3:$S$21,MATCH(ROWS($U$3:U22),$U$3:$U$21,0)),\"\")","v":""},{"$f":"IFERROR(INDEX($S$3:$S$21,MATCH(ROWS($U$3:V22),$U$3:$U$21,0)),\"\")","v":""},{"$f":"IFERROR(INDEX($S$3:$S$21,MATCH(ROWS($U$3:U22),$U$3:$U$21,0)),\"\")","v":""},null,{"$f":"$V$3:INDEX($V$3:$V$21,MAX($U$3:$U$21),1)","v":"Friday Harbor, San Juan Island"}]
[null,"mm to Inches & inches  to Gallon",{"$f":"C22*(7.49/12)","v":2.6215000000000002},{"$f":"D22*(7.49/12)","v":1.3107500000000001},1.2483333333333333,0.9986666666666667,0.93625000000000003,0.68658333333333332,0.49933333333333335,0.56174999999999997,0.87383333333333324,1.6852500000000001,2.4966666666666666,1.7476666666666665,{"$f":"SUM(C23:N23)","v":15.666583333333332},null,null,null,"Port Angeles",0,{"$f":"IF(T23=1,COUNTIF($T$3:T23,1),\"\")","v":""},{"$f":"IFERROR(INDEX($S$3:$S$21,MATCH(ROWS($U$3:U23),$U$3:$U$21,0)),\"\")","v":""},{"$f":"IFERROR(INDEX($S$3:$S$21,MATCH(ROWS($U$3:V23),$U$3:$U$21,0)),\"\")","v":""},{"$f":"IFERROR(INDEX($S$3:$S$21,MATCH(ROWS($U$3:U23),$U$3:$U$21,0)),\"\")","v":""},null,{"$f":"$V$3:INDEX($V$3:$V$21,MAX($U$3:$U$21),1)","v":"Friday Harbor, San Juan Island"}]
[null,null,"OUTPUTS",null,null,null,null,null,null,null,null,null,null,null,null,null,null,null,"Forks",0,{"$f":"IF(T24=1,COUNTIF($T$3:T24,1),\"\")","v":""},{"$f":"IFERROR(INDEX($S$3:$S$21,MATCH(ROWS($U$3:U24),$U$3:$U$21,0)),\"\")","v":""},{"$f":"IFERROR(INDEX($S$3:$S$21,MATCH(ROWS($U$3:V24),$U$3:$U$21,0)),\"\")","v":""},{"$f":"IFERROR(INDEX($S$3:$S$21,MATCH(ROWS($U$3:U24),$U$3:$U$21,0)),\"\")","v":""},null,{"$f":"$V$3:INDEX($V$3:$V$21,MAX($U$3:$U$21),1)","v":"Friday Harbor, San Juan Island"}]
[null,"MONTH","JAN","FEB","MAR","APR","MAY","JUN","JUL","AUG","SEPT","OCT","NOV","DEC","TOTAL","Column1",null,null,"Grayland",0,{"$f":"IF(T25=1,COUNTIF($T$3:T25,1),\"\")","v":""},{"$f":"IFERROR(INDEX($S$3:$S$21,MATCH(ROWS($U$3:U25),$U$3:$U$21,0)),\"\")","v":""},{"$f":"IFERROR(INDEX($S$3:$S$21,MATCH(ROWS($U$3:V25),$U$3:$U$21,0)),\"\")","v":""},{"$f":"IFERROR(INDEX($S$3:$S$21,MATCH(ROWS($U$3:U25),$U$3:$U$21,0)),\"\")","v":""},null,{"$f":"$V$3:INDEX($V$3:$V$21,MAX($U$3:$U$21),1)","v":"Friday Harbor, San Juan Island"}]
[null,"Precipitation Received from Roof (US gals)",{"$f":"($C$36*C23)*$C$37","v":5898.375},2949.1875,2808.75,2247.0000000000005,2106.5625,1544.8125,1123.5000000000002,1263.9375,1966.1249999999998,3791.8125,5617.5,3932.2499999999995,35249.8125,null,null,null,"Anacortes",0,{"$f":"IF(T26=1,COUNTIF($T$3:T26,1),\"\")","v":""},{"$f":"IFERROR(INDEX($S$3:$S$21,MATCH(ROWS($U$3:U26),$U$3:$U$21,0)),\"\")","v":""},{"$f":"IFERROR(INDEX($S$3:$S$21,MATCH(ROWS($U$3:V26),$U$3:$U$21,0)),\"\")","v":""},{"$f":"IFERROR(INDEX($S$3:$S$21,MATCH(ROWS($U$3:U26),$U$3:$U$21,0)),\"\")","v":""},null,{"$f":"$V$3:INDEX($V$3:$V$21,MAX($U$3:$U$21),1)","v":"Friday Harbor, San Juan Island"}]
[null,"Start of Month in Storage (US gals) (Last Dec.)        ",{"$f":"N17","v":4549.75},{"$f":"IF(C33>0,(C33),(0))","v":6000},{"$f":"IF(D33>0,(D33),(0))","v":6000},{"$f":"IF(E33>0,(E33),(0))","v":6000},{"$f":"IF(F33>0,(F33),(0))","v":5747},{"$f":"IF(G33>0,(G33),(0))","v":5353.5625},{"$f":"IF(H33>0,(H33),(0))","v":3398.375},{"$f":"IF(I33>0,(I33),(0))","v":21.875},{"$f":"IF(J33>0,(J33),(0))","v":0},{"$f":"IF(K33>0,(K33),(0))","v":0},{"$f":"IF(L33>0,(L33),(0))","v":0},{"$f":"IF(M33>0,(M33),(0))","v":3117.5},null,null,null,null,"Bellingham",0,{"$f":"IF(T27=1,COUNTIF($T$3:T27,1),\"\")","v":""},{"$f":"IFERROR(INDEX($S$3:$S$21,MATCH(ROWS($U$3:U27),$U$3:$U$21,0)),\"\")","v":""},{"$f":"IFERROR(INDEX($S$3:$S$21,MATCH(ROWS($U$3:V27),$U$3:$U$21,0)),\"\")","v":""},{"$f":"IFERROR(INDEX($S$3:$S$21,MATCH(ROWS($U$3:U27),$U$3:$U$21,0)),\"\")","v":""},null,{"$f":"$V$3:INDEX($V$3:$V$21,MAX($U$3:$U$21),1)","v":"Friday Harbor, San Juan Island"}]
[null,"Household Usage (US gals)                        ",2500,2500,2500,2500,2500,2500,2500,2500,2500,2500,2500,2500,30000,null,null,null,"Bremerton",0,{"$f":"IF(T28=1,COUNTIF($T$3:T28,1),\"\")","v":""},{"$f":"IFERROR(INDEX($S$3:$S$21,MATCH(ROWS($U$3:U28),$U$3:$U$21,0)),\"\")","v":""},{"$f":"IFERROR(INDEX($S$3:$S$21,MATCH(ROWS($U$3:V28),$U$3:$U$21,0)),\"\")","v":""},{"$f":"IFERROR(INDEX($S$3:$S$21,MATCH(ROWS($U$3:U28),$U$3:$U$21,0)),\"\")","v":""},null,{"$f":"$V$3:INDEX($V$3:$V$21,MAX($U$3:$U$21),1)","v":"Friday Harbor, San Juan Island"}]
[null,"Irrigation/Outside Usage (US gals)                           ",null,null,null,null,null,1000,2000,2000,2000,1500,null,null,8500,null,null,null,"Everett",0,{"$f":"IF(T29=1,COUNTIF($T$3:T29,1),\"\")","v":""},{"$f":"IFERROR(INDEX($S$3:$S$21,MATCH(ROWS($U$3:U29),$U$3:$U$21,0)),\"\")","v":""},{"$f":"IFERROR(INDEX($S$3:$S$21,MATCH(ROWS($U$3:V29),$U$3:$U$21,0)),\"\")","v":""},{"$f":"IFERROR(INDEX($S$3:$S$21,MATCH(ROWS($U$3:U29),$U$3:$U$21,0)),\"\")","v":""},null,{"$f":"$V$3:INDEX($V$3:$V$21,MAX($U$3:$U$21),1)","v":"Friday Harbor, San Juan Island"}]
[null,"Total Usage  (US gals)",{"$f":"C29+C28","v":2500},{"$f":"D29+D28","v":2500},2500,2500,2500,3500,4500,4500,4500,4000,2500,2500,38500,null,null,null,"Longview",0,{"$f":"IF(T30=1,COUNTIF($T$3:T30,1),\"\")","v":""},{"$f":"IFERROR(INDEX($S$3:$S$21,MATCH(ROWS($U$3:U30),$U$3:$U$21,0)),\"\")","v":""},{"$f":"IFERROR(INDEX($S$3:$S$21,MATCH(ROWS($U$3:V30),$U$3:$U$21,0)),\"\")","v":""},{"$f":"IFERROR(INDEX($S$3:$S$21,MATCH(ROWS($U$3:U30),$U$3:$U$21,0)),\"\")","v":""},null,{"$f":"$V$3:INDEX($V$3:$V$21,MAX($U$3:$U$21),1)","v":"Friday Harbor, San Juan Island"}]
[null,"End of Month (no Storage Limit) (imp gals)",{"$f":"C26+C27-C30","v":7948.125},6449.1875,6308.75,5747,5353.5625,3398.375,21.875,-3214.1875,-2533.875,-208.1875,3117.5,4549.75,null,{"$f":"SUM(C31:N31)","v":36937.875},null,null,"Olga, Orcas Island",0,{"$f":"IF(T31=1,COUNTIF($T$3:T31,1),\"\")","v":""},{"$f":"IFERROR(INDEX($S$3:$S$21,MATCH(ROWS($U$3:U31),$U$3:$U$21,0)),\"\")","v":""},{"$f":"IFERROR(INDEX($S$3:$S$21,MATCH(ROWS($U$3:V31),$U$3:$U$21,0)),\"\")","v":""},{"$f":"IFERROR(INDEX($S$3:$S$21,MATCH(ROWS($U$3:U31),$U$3:$U$21,0)),\"\")","v":""},null,{"$f":"$V$3:INDEX($V$3:$V$21,MAX($U$3:$U$21),1)","v":"Friday Harbor, San Juan Island"}]
[null,"Overflow Volume - wastage  (imp gals)",{"$f":"C31-C33","v":1948.125},{"$f":"D31-D33","v":449.1875},308.75,0,0,0,0,0,0,0,0,0,2706.0625]
[null,"End of Month in Storage (US gals) (make-up)",{"$f":"IF(C31>$C$35,($C$35),(C31))","v":6000},6000,6000,5747,5353.5625,3398.375,21.875,-3214.1875,-2533.875,-208.1875,3117.5,4549.75,null,{"$f":"SUM(C33:N33)","v":34231.8125},null,null,"Olympia",{"$f":"--ISNUMBER(IFERROR(SEARCH($K$2,S33,1),\"\"))","v":0},{"$f":"IF(T33=1,COUNTIF($T$3:T33,1),\"\")","v":""},{"$f":"IFERROR(INDEX($S$3:$S$21,MATCH(ROWS($U$3:U33),$U$3:$U$21,0)),\"\")","v":""},{"$f":"IFERROR(INDEX($S$3:$S$21,MATCH(ROWS($U$3:V33),$U$3:$U$21,0)),\"\")","v":""},{"$f":"IFERROR(INDEX($S$3:$S$21,MATCH(ROWS($U$3:U33),$U$3:$U$21,0)),\"\")","v":""},null,{"$f":"$V$3:INDEX($V$3:$V$21,MAX($U$3:$U$21),1)","v":"Friday Harbor, San Juan Island"}]
[null,null,null,null,null,null,null,null,null,null,null,null,null,null,null,null,null,null,"Tacoma",0,{"$f":"IF(T34=1,COUNTIF($T$3:T34,1),\"\")","v":""},{"$f":"IFERROR(INDEX($S$3:$S$21,MATCH(ROWS($U$3:U34),$U$3:$U$21,0)),\"\")","v":""},{"$f":"IFERROR(INDEX($S$3:$S$21,MATCH(ROWS($U$3:V34),$U$3:$U$21,0)),\"\")","v":""},{"$f":"IFERROR(INDEX($S$3:$S$21,MATCH(ROWS($U$3:U34),$U$3:$U$21,0)),\"\")","v":""},null,{"$f":"$V$3:INDEX($V$3:$V$21,MAX($U$3:$U$21),1)","v":"Friday Harbor, San Juan Island"}]
[null,"SELECTED TANK CAPACITY (US GALS)",6000,null,null,null,null,null,null,null,null,null,null,null,null,null,null,null,"Vancouver",{"$f":"--ISNUMBER(IFERROR(SEARCH($K$2,S35,1),\"\"))","v":0},{"$f":"IF(T35=1,COUNTIF($T$3:T35,1),\"\")","v":""},{"$f":"IFERROR(INDEX($S$3:$S$21,MATCH(ROWS($U$3:U35),$U$3:$U$21,0)),\"\")","v":""},{"$f":"IFERROR(INDEX($S$3:$S$21,MATCH(ROWS($U$3:V35),$U$3:$U$21,0)),\"\")","v":""},{"$f":"IFERROR(INDEX($S$3:$S$21,MATCH(ROWS($U$3:U35),$U$3:$U$21,0)),\"\")","v":""},null,{"$f":"$V$3:INDEX($V$3:$V$21,MAX($U$3:$U$21),1)","v":"Friday Harbor, San Juan Island"}]
[null,"ROOF AREA (SQFT)",2500,null,null,null,null,null,null,null,null,null,null,null,null,null,null,null,"Baker Lake Dam",{"$f":"--ISNUMBER(IFERROR(SEARCH($K$2,S36,1),\"\"))","v":0},{"$f":"IF(T36=1,COUNTIF($T$3:T36,1),\"\")","v":""},{"$f":"IFERROR(INDEX($S$3:$S$21,MATCH(ROWS($U$3:U36),$U$3:$U$21,0)),\"\")","v":""},{"$f":"IFERROR(INDEX($S$3:$S$21,MATCH(ROWS($U$3:V36),$U$3:$U$21,0)),\"\")","v":""},{"$f":"IFERROR(INDEX($S$3:$S$21,MATCH(ROWS($U$3:U36),$U$3:$U$21,0)),\"\")","v":""},null,{"$f":"$V$3:INDEX($V$3:$V$21,MAX($U$3:$U$21),1)","v":"Friday Harbor, San Juan Island"}]
[null,"ROOF EFFICIENCY",0.9,null,null,null,null,null,null,null,null,null,null,null,null,null,null,null,"Baring",{"$f":"--ISNUMBER(IFERROR(SEARCH($K$2,S37,1),\"\"))","v":0},{"$f":"IF(T37=1,COUNTIF($T$3:T37,1),\"\")","v":""},{"$f":"IFERROR(INDEX($S$3:$S$21,MATCH(ROWS($U$3:U37),$U$3:$U$21,0)),\"\")","v":""},{"$f":"IFERROR(INDEX($S$3:$S$21,MATCH(ROWS($U$3:V37),$U$3:$U$21,0)),\"\")","v":""},{"$f":"IFERROR(INDEX($S$3:$S$21,MATCH(ROWS($U$3:U37),$U$3:$U$21,0)),\"\")","v":""},null,{"$f":"$V$3:INDEX($V$3:$V$21,MAX($U$3:$U$21),1)","v":"Friday Harbor, San Juan Island"}]
[null,null,null,null,null,null,null,null,null,null,null,null,null,null,null,null,null,null,"Tacoma",{"$f":"--ISNUMBER(IFERROR(SEARCH($K$2,S38,1),\"\"))","v":0},{"$f":"IF(T38=1,COUNTIF($T$3:T38,1),\"\")","v":""},{"$f":"IFERROR(INDEX($S$3:$S$21,MATCH(ROWS($U$3:U38),$U$3:$U$21,0)),\"\")","v":""},{"$f":"IFERROR(INDEX($S$3:$S$21,MATCH(ROWS($U$3:V38),$U$3:$U$21,0)),\"\")","v":""},{"$f":"IFERROR(INDEX($S$3:$S$21,MATCH(ROWS($U$3:U38),$U$3:$U$21,0)),\"\")","v":""},null,{"$f":"$V$3:INDEX($V$3:$V$21,MAX($U$3:$U$21),1)","v":"Friday Harbor, San Juan Island"}]
[null,"ANNUAL OVERFLOW VOLUME (WASTAGE)",{"$f":"100%-((O26-(P31-P33))/O26)","v":7.6768138837617905E-2},null,null,null,null,null,null,null,null,null,null,null,null,null,null,null,"Port Townsend",0,{"$f":"IF(T39=1,COUNTIF($T$3:T39,1),\"\")","v":""},{"$f":"IFERROR(INDEX($S$3:$S$21,MATCH(ROWS($U$3:U39),$U$3:$U$21,0)),\"\")","v":""},{"$f":"IFERROR(INDEX($S$3:$S$21,MATCH(ROWS($U$3:V39),$U$3:$U$21,0)),\"\")","v":""},{"$f":"IFERROR(INDEX($S$3:$S$21,MATCH(ROWS($U$3:U39),$U$3:$U$21,0)),\"\")","v":""},null,{"$f":"$V$3:INDEX($V$3:$V$21,MAX($U$3:$U$21),1)","v":"Friday Harbor, San Juan Island"}]
[null,"ANNUAL MAKE-UP WATER (SHORTFALL) ",{"$f":"(IF(C31<0,($C31),(0))+IF(D31<0,($D31),(0))+IF(E31<0,($E31),(0))+IF(F31<0,($F31),(0))+IF(G31<0,($G31),(0))+IF(H31<0,($H31),(0))+IF(I31<0,($I31),(0))+IF(J31<0,($J31),(0))+IF(K31<0,($K31),(0))+IF(L31<0,($L31),(0))+IF(M31<0,($M31),(0))+IF(N31<0,($N31),(0)))/O30","v":-0.15470779220779221},null,null,null,null,null,null,null,null,null,null,null,null,null,null,null,"Seattle",0,{"$f":"IF(T40=1,COUNTIF($T$3:T40,1),\"\")","v":""},{"$f":"IFERROR(INDEX($S$3:$S$21,MATCH(ROWS($U$3:U40),$U$3:$U$21,0)),\"\")","v":""},{"$f":"IFERROR(INDEX($S$3:$S$21,MATCH(ROWS($U$3:V40),$U$3:$U$21,0)),\"\")","v":""},{"$f":"IFERROR(INDEX($S$3:$S$21,MATCH(ROWS($U$3:U40),$U$3:$U$21,0)),\"\")","v":""},null,{"$f":"$V$3:INDEX($V$3:$V$21,MAX($U$3:$U$21),1)","v":"Friday Harbor, San Juan Island"}]
[]
[null,"Notes:",null,null,null,null,null,null,null,null,null,null,null,null,null,null,null,null,"Bonavista",{"$f":"--ISNUMBER(IFERROR(SEARCH($K$2,S42,1),\"\"))","v":0},{"$f":"IF(T42=1,COUNTIF($T$3:T42,1),\"\")","v":""},{"$f":"IFERROR(INDEX($S$3:$S$271,MATCH(ROWS($U$3:U42),$U$3:$U$271,0)),\"\")","v":""},{"$f":"IFERROR(INDEX($S$3:$S$271,MATCH(ROWS($U$3:V42),$U$3:$U$271,0)),\"\")","v":""},{"$f":"IFERROR(INDEX($S$3:$S$271,MATCH(ROWS($U$3:U42),$U$3:$U$271,0)),\"\")","v":""},null,{"$f":"$V$3:INDEX($V$3:$V$271,MAX($U$3:$U$271),1)","v":"Friday Harbor, San Juan Island"}]
[null,"- Performance based on monthly averages. ",null,null,null,null,null,null,null,null,null,null,null,null,null,null,null,null,"Brandon",0,{"$f":"IF(T43=1,COUNTIF($T$3:T43,1),\"\")","v":""},{"$f":"IFERROR(INDEX($S$3:$S$271,MATCH(ROWS($U$3:U43),$U$3:$U$271,0)),\"\")","v":""},{"$f":"IFERROR(INDEX($S$3:$S$271,MATCH(ROWS($U$3:V43),$U$3:$U$271,0)),\"\")","v":""},{"$f":"IFERROR(INDEX($S$3:$S$271,MATCH(ROWS($U$3:U43),$U$3:$U$271,0)),\"\")","v":""},null,{"$f":"$V$3:INDEX($V$3:$V$271,MAX($U$3:$U$271),1)","v":"Friday Harbor, San Juan Island"}]
[null,"- Bracketed numbers indicate rainwater shortfall",null,null,null,null,null,null,null,null,null,null,null,null,null,null,null,null,"Brantford",0,{"$f":"IF(T44=1,COUNTIF($T$3:T44,1),\"\")","v":""},{"$f":"IFERROR(INDEX($S$3:$S$271,MATCH(ROWS($U$3:U44),$U$3:$U$271,0)),\"\")","v":""},{"$f":"IFERROR(INDEX($S$3:$S$271,MATCH(ROWS($U$3:V44),$U$3:$U$271,0)),\"\")","v":""},{"$f":"IFERROR(INDEX($S$3:$S$271,MATCH(ROWS($U$3:U44),$U$3:$U$271,0)),\"\")","v":""},null,{"$f":"$V$3:INDEX($V$3:$V$271,MAX($U$3:$U$271),1)","v":"Friday Harbor, San Juan Island"}]
[null,"- Precipitation includes snowfall",null,null,null,null,null,null,null,null,null,null,null,null,null,null,null,null,"Bridgewater",0,{"$f":"IF(T45=1,COUNTIF($T$3:T45,1),\"\")","v":""},{"$f":"IFERROR(INDEX($S$3:$S$271,MATCH(ROWS($U$3:U45),$U$3:$U$271,0)),\"\")","v":""},{"$f":"IFERROR(INDEX($S$3:$S$271,MATCH(ROWS($U$3:V45),$U$3:$U$271,0)),\"\")","v":""},{"$f":"IFERROR(INDEX($S$3:$S$271,MATCH(ROWS($U$3:U45),$U$3:$U$271,0)),\"\")","v":""},null,{"$f":"$V$3:INDEX($V$3:$V$271,MAX($U$3:$U$271),1)","v":"Friday Harbor, San Juan Island"}]
[null,"- Useful links:",null,null,null,null,null,null,null,null,null,null,null,null,null,null,null,null,"Brooks",0,{"$f":"IF(T46=1,COUNTIF($T$3:T46,1),\"\")","v":""},{"$f":"IFERROR(INDEX($S$3:$S$271,MATCH(ROWS($U$3:U46),$U$3:$U$271,0)),\"\")","v":""},{"$f":"IFERROR(INDEX($S$3:$S$271,MATCH(ROWS($U$3:V46),$U$3:$U$271,0)),\"\")","v":""},{"$f":"IFERROR(INDEX($S$3:$S$271,MATCH(ROWS($U$3:U46),$U$3:$U$271,0)),\"\")","v":""},null,{"$f":"$V$3:INDEX($V$3:$V$271,MAX($U$3:$U$271),1)","v":"Friday Harbor, San Juan Island"}]
[null," *Rainwater Guide for Homeowners - CMHC",null,null,null,null,null,null,null,null,null,null,null,null,null,null,null,null,"Buctouche",0,{"$f":"IF(T47=1,COUNTIF($T$3:T47,1),\"\")","v":""},{"$f":"IFERROR(INDEX($S$3:$S$271,MATCH(ROWS($U$3:U47),$U$3:$U$271,0)),\"\")","v":""},{"$f":"IFERROR(INDEX($S$3:$S$271,MATCH(ROWS($U$3:V47),$U$3:$U$271,0)),\"\")","v":""},{"$f":"IFERROR(INDEX($S$3:$S$271,MATCH(ROWS($U$3:U47),$U$3:$U$271,0)),\"\")","v":""},null,{"$f":"$V$3:INDEX($V$3:$V$271,MAX($U$3:$U$271),1)","v":"Friday Harbor, San Juan Island"}]
[null," *Irrigation Discussion",null,null,null,null,null,null,null,null,null,null,null,null,null,null,null,null,"Buffalo Narrows",0,{"$f":"IF(T48=1,COUNTIF($T$3:T48,1),\"\")","v":""},{"$f":"IFERROR(INDEX($S$3:$S$271,MATCH(ROWS($U$3:U48),$U$3:$U$271,0)),\"\")","v":""},{"$f":"IFERROR(INDEX($S$3:$S$271,MATCH(ROWS($U$3:V48),$U$3:$U$271,0)),\"\")","v":""},{"$f":"IFERROR(INDEX($S$3:$S$271,MATCH(ROWS($U$3:U48),$U$3:$U$271,0)),\"\")","v":""},null,{"$f":"$V$3:INDEX($V$3:$V$271,MAX($U$3:$U$271),1)","v":"Friday Harbor, San Juan Island"}]
[null," *Irrigation Calculator",null,null,null,null,null,null,null,null,null,null,null,null,null,null,null,null,"Burgeo",0,{"$f":"IF(T49=1,COUNTIF($T$3:T49,1),\"\")","v":""},{"$f":"IFERROR(INDEX($S$3:$S$271,MATCH(ROWS($U$3:U49),$U$3:$U$271,0)),\"\")","v":""},{"$f":"IFERROR(INDEX($S$3:$S$271,MATCH(ROWS($U$3:V49),$U$3:$U$271,0)),\"\")","v":""},{"$f":"IFERROR(INDEX($S$3:$S$271,MATCH(ROWS($U$3:U49),$U$3:$U$271,0)),\"\")","v":""},null,{"$f":"$V$3:INDEX($V$3:$V$271,MAX($U$3:$U$271),1)","v":"Friday Harbor, San Juan Island"}]
[null," *Premierplastics.com",null,null,null,null,null,null,null,null,null,null,null,null,null,null,null,null,"Calgary",0,{"$f":"IF(T50=1,COUNTIF($T$3:T50,1),\"\")","v":""},{"$f":"IFERROR(INDEX($S$3:$S$271,MATCH(ROWS($U$3:U50),$U$3:$U$271,0)),\"\")","v":""},{"$f":"IFERROR(INDEX($S$3:$S$271,MATCH(ROWS($U$3:V50),$U$3:$U$271,0)),\"\")","v":""},{"$f":"IFERROR(INDEX($S$3:$S$271,MATCH(ROWS($U$3:U50),$U$3:$U$271,0)),\"\")","v":""},null,{"$f":"$V$3:INDEX($V$3:$V$271,MAX($U$3:$U$271),1)","v":"Friday Harbor, San Juan Island"}]
[null,null,null,null,null,null,null,null,null,null,null,null,null,null,null,null,null,null,"Campbell River",0,{"$f":"IF(T51=1,COUNTIF($T$3:T51,1),\"\")","v":""},{"$f":"IFERROR(INDEX($S$3:$S$271,MATCH(ROWS($U$3:U51),$U$3:$U$271,0)),\"\")","v":""},{"$f":"IFERROR(INDEX($S$3:$S$271,MATCH(ROWS($U$3:V51),$U$3:$U$271,0)),\"\")","v":""},{"$f":"IFERROR(INDEX($S$3:$S$271,MATCH(ROWS($U$3:U51),$U$3:$U$271,0)),\"\")","v":""},null,{"$f":"$V$3:INDEX($V$3:$V$271,MAX($U$3:$U$271),1)","v":"Friday Harbor, San Juan Island"}]

{"sheet":"Rainfall Data","index":1,"n_rows":40,"n_cols":13,"rows_kept":40,"cut":false,"hidden":true,"merged":[[1,0,1,1]]}
[]
[]
["Place","JAN","FEB","MAR","APR","MAY","JUN","JUL","AUG","SEPT","OCT","NOV","DEC"]
["Aberdeen",13.6,9.3000000000000007,9,6.2,3.8,2.6,1.2,1.5,2.5,7.7,14.3,12.9]
["Clearwater",16.5,11.2,12.2,8.6,5.6,3.8,2.2000000000000002,2.7,4.3,10.7,16.8,14.3]
["Forks",18.3,12.7,13.5,9.1999999999999993,5.8,3.9,2.5,2.6,4,11.8,18.600000000000001,16.8]
["Friday Harbor, San Juan Island",4.2,2.1,2,1.6,1.5,1.1000000000000001,0.8,0.9,1.4,2.7,4,2.8]
["Grayland",11.1,7.9,8.1,5.7,3.6,2.6,1.4,1.6,2.6,7.6,12.1,10.8]
["Long Beach",11.8,8.4,8.6,6.3,3.8,2.9,1.4,1.7,2.6,7.2,12.3,11.7]
["Port Angeles",4,2.2999999999999998,2.2000000000000002,1.3,1.1000000000000001,0.9,0.6,0.7,0.9,2.7,4.5,4.0999999999999996]
["Anacortes",3.6,2.2999999999999998,2.2999999999999998,1.9,1.9,1.5,0.9,1,1.5,2.8,4.7,3.4]
["Bellingham",4.7,3,3.2,2.7,2.5,1.9,1.2,1.2,1.8,3.7,5.8,4.2]
["Bremerton",8.9,6,6,3.6,2.5,1.7,0.9,1,1.6,4.9000000000000004,9.4,10.1]
["Everett",5.0999999999999996,3.1,3.7,3,2.7,2.2999999999999998,1.2,1.2,2,3.6,5.6,5.2]
["Longview",6.6,4.9000000000000004,4.7,3.8,3.2,2.2999999999999998,0.8,1.2,2.1,4,7.7,6.8]
["Olga, Orcas Island",3.9,2.4,2.2999999999999998,1.9,1.8,1.3,0.8,1.1000000000000001,1.3,3,4.8,3.5]
["Olympia",7.8,5.3,5.3,3.5,2.2999999999999998,1.8,0.6,0.9,1.7,4.5999999999999996,8.6,7.5]
["Port Townsend",2.2999999999999998,1.5,1.7,1.5,1.7,1.3,0.8,0.7,1,1.6,2.7,2.5]
["Seattle",5.5,3.5,3.9,2.8,2,1.6,0.9,0.9,1.3,3.4,6,6.1]
["Tacoma",5.9,3.9,4.0999999999999996,3,2.1,1.6,0.7,0.8,1.3,3.7,6.7,5.5]
["Vancouver",5.9,4.4000000000000004,4.2,3.2,2.7,1.9,0.7,0.7,1.6,3.4,6.5,6.4]
["Baker Lake Dam",14.7,9.3000000000000007,9.3000000000000007,6.7,5.0999999999999996,3.7,2.2999999999999998,2.1,4.2,10.1,16.899999999999999,13.6]
["Baring",16,10.3,10.4,7.8,5.6,4.2,2.1,2,4.5999999999999996,11,18.899999999999999,14]
["Darrington",11.6,8.5,7.3,5.4,4,3.2,1.6,1.7,3,7.7,15.1,12.1]
["Mt Adams Ranger Station",7.4,5.0999999999999996,5.5,2.4,1.7,1.3,0.5,0.7,1.1000000000000001,3.9,7.8,8.6]
["Mt Rainier Paradise Ranger Station",18.2,12.7,12.6,8.3000000000000007,5.9,4.0999999999999996,2,2,4.7,10.4,20.3,17.2]
["Mud Mountain Lake Dam",7.2,5,5.8,5,4.8,3.9,1.9,1.7,2.8,5,8.6999999999999993,5.8]
["Ross Dam",9.3000000000000007,5.9,5.2,3.1,2.1,1.7,1.2,1.3,2.1,6.1,11.2,8.5]
["Stampede Pass",12.1,7.6,7.6,5.3,4.3,3.4,1.5,1.5,4.0999999999999996,7.8,14.7,11.3]
["Boundary Dam",3,1.9,2.2000000000000002,2.2000000000000002,2.7,3.1,1.6,1.2,1.4,2.1,3.2,3.5]
["Chelan",1.6,1.3,0.9,0.6,1,0.9,0.4,0.3,0.4,0.8,1.8,1.6]
["Coulee Dam",1.1000000000000001,1,0.9,0.9,1.2,1.1000000000000001,0.6,0.3,0.4,0.7,1.3,1.5]
["Kennewick",1.1000000000000001,0.8,0.7,0.6,0.6,0.5,0.2,0.2,0.3,0.6,1,1.1000000000000001]
["Leavenworth",4.5,2.6,2.1,1.1000000000000001,1.1000000000000001,1.1000000000000001,0.4,0.5,0.7,2.1,4.5,4.5]
["Pullman",2.6,1.9,2,1.8,1.8,1.3,0.7,0.7,0.8,1.6,2.9,2.5]
["Spokane",1.8,1.3,1.6,1.3,1.6,1.3,0.6,0.6,0.7,1.2,2.2999999999999998,2.2999999999999998]
["Walla Walla",2.5,1.8,2.2999999999999998,1.9,2.1,1.3,0.6,0.6,0.8,1.7,2.9,2.5]
["Wenatchee",1.5,1.1000000000000001,0.7,0.6,0.6,0.6,0.3,0.2,0.3,0.6,1.4,1.6]
["Winthrop",2,1.3,1,0.8,1.1000000000000001,1.2,0.8,0.5,0.4,1.1000000000000001,2.1,2.5]
["Yakima",1.2,0.8,0.6,0.6,0.6,0.6,0.2,0.3,0.4,0.5,1.1000000000000001,1.5]

{"sheet":"Rainfall Data (2)","index":2,"n_rows":271,"n_cols":13,"rows_kept":271,"cut":false,"hidden":true,"merged":[[1,0,1,1]]}
[]
[]
["Place","JAN","FEB","MAR","APR","MAY","JUN","JUL","AUG","SEPT","OCT","NOV","DEC"]
["Abbotsford",212,132,149,118,100,75,43,46,75,153,248,187]
["Atlin",46,25,17,9,18,30,33,34,42,37,36,36]
["Barkerville",96,61,66,58,78,102,100,81,82,92,111,95]
["Bella Coola",157,88,76,56,48,51,42,60,90,195,205,131]
["Campbell River",217,149,140,92,68,63,39,45,55,162,232,226]
["Castlegar",76,51,63,59,70,72,48,30,42,51,97,90]
["Chilliwack",233,126,155,116,93,92,48,57,75,178,284,210]
["Cortes Island, Whaletown",184,131,107,100,73,70,49,55,61,155,224,181]
["Courtenay - Comox",172,114,106,65,46,43,27,29,42,123,201,188]
["Cranbrook",26,19,22,25,46,62,38,28,31,20,35,33]
["Duncan",277,146,154,81,56,41,23,35,41,153,247,254]
["Fort Nelson",21,15,19,19,49,63,78,71,40,33,26,18]
["Fort St John",25,19,24,20,38,66,75,51,45,31,29,22]
["Gabriola Island",147,96,92,63,48,43,24,27,34,86,157,141]
["Gibsons",183,110,125,104,91,67,41,49,60,152,213,174]
["Gold River",424,286,266,187,120,91,56,71,109,359,491,391]
["Golden",46,24,24,24,34,50,51,45,38,35,51,44]
["Kamloops",21,12,13,14,27,37,31,24,29,19,23,25]
["Kelowna",30,20,21,24,31,40,33,26,27,24,35,32]
["Lillooet",38,20,17,19,26,24,36,26,24,34,44,42]
["Mayne Island, Village Bay",130,88,75,55,44,37,21,24,28,80,135,125]
["Nanaimo",188,126,113,67,54,43,25,28,36,102,197,184]
["North Vancouver, Capilano",330,279,218,207,132,124,61,72,98,248,437,316]
["Penticton",27,20,24,26,39,46,29,28,25,26,28,29]
["Port Alberni",291,255,190,127,79,55,26,38,49,204,317,276]
["Port Hardy",247,160,160,125,79,81,54,73,110,257,312,251]
["Port Renfrew",556,377,362,259,155,108,51,82,124,371,580,481]
["Powell River",159,109,111,83,77,68,37,45,55,126,178,158]
["Prince George",54,29,27,33,42,61,59,46,54,60,48,44]
["Prince Rupert",328,221,235,211,160,127,127,177,297,432,375,371]
["Revelstoke",108,80,62,67,58,75,72,67,55,84,118,104]
["Saltspring Island",162,99,89,57,43,37,23,28,33,94,168,154]
["Sandspit, Haida Gwaii",191,131,117,98,66,52,48,62,83,170,194,196]
["Sidney",143,89,78,48,38,31,18,24,31,88,153,142]
["Smithers",43,23,21,24,38,55,46,44,54,65,55,42]
["Sparwood",54,41,44,41,60,69,47,35,47,49,72,53]
["Tofino",487,336,330,270,153,130,71,88,133,342,492,440]
["Vancouver",223,111,125,102,75,68,43,48,59,157,238,207]
["Vernon",33,25,29,32,42,49,42,28,37,27,44,38]
["Victoria",103,74,50,39,36,27,17,22,25,74,138,102]
["Whistler",176,105,98,76,67,59,45,47,55,155,192,154]
["Williams Lake",33,19,18,22,39,59,53,46,42,41,42,38]
["Brooks",13,9,19,22,35,74,26,38,29,11,13,12]
["Cardston",21,19,37,41,81,91,45,44,53,32,30,21]
["Lethbridge",13,12,23,28,50,82,43,37,41,20,18,13]
["Medicine Hat",13,8,19,20,44,65,36,34,37,19,15,12]
["Taber",17,14,24,32,48,91,29,39,37,19,17,15]
["Waterton Village",52,32,38,52,70,115,19,41,58,41,47,30]
["Banff",20,17,21,34,62,68,68,62,39,32,26,21]
["Calgary",9,9,18,25,57,94,66,57,45,15,13,10]
["Camrose",23,14,23,29,41,74,86,52,40,24,19,15]
["Edmonton",22,12,16,29,46,77,94,62,43,22,18,15]
["Edson",27,12,18,23,54,94,108,75,64,25,20,18]
["Jasper",23,14,17,20,31,51,64,64,34,30,24,20]
["Lloydminster",16,10,14,26,45,71,75,60,42,18,18,14]
["Red Deer",22,13,21,21,56,89,97,63,51,21,18,14]
["Rocky Mountain House",19,15,18,24,65,87,115,67,74,26,17,16]
["Cold Lake",16,11,17,31,41,73,79,57,39,20,19,18]
["Fort Chipewyan",15,14,16,16,27,44,67,50,44,29,24,18]
["Fort McMurray",18,13,17,21,36,73,81,57,40,26,20,16]
["Grande Prairie",30,16,17,20,41,76,76,56,43,26,25,19]
["High Level",20,18,18,15,36,51,66,43,32,31,25,19]
["Slave Lake",16,10,16,22,43,78,71,60,42,25,16,12]
["Emerson",27,21,25,29,58,90,94,74,57,47,37,33]
["Gimli",20,14,31,28,42,104,78,57,58,47,28,20]
["Hodgson",36,23,35,29,62,87,69,67,59,47,37,43]
["Morden",19,19,22,35,58,93,79,71,45,50,30,20]
["Portage La Prairie",23,15,26,25,43,82,80,74,57,46,29,26]
["Selkirk",14,9,23,22,60,96,87,81,55,39,20,14]
["Steinbach",22,14,22,31,69,100,93,74,57,46,28,24]
["Winnipeg",20,14,24,30,57,90,80,77,46,38,25,21]
["Brandon",18,13,25,26,59,81,73,66,44,30,19,21]
["Dauphin",14,11,24,30,55,82,73,61,58,35,21,19]
["McCreary",21,18,34,30,63,88,74,62,58,43,26,23]
["Swan River",22,16,24,35,54,85,96,77,53,34,25,24]
["Turtle Mountain Park",19,15,25,26,61,86,82,67,41,37,24,21]
["Churchill",19,17,18,24,30,44,60,69,70,48,35,18]
["Cross Lake",16,18,16,19,42,68,77,70,60,34,25,23]
["Flin Flon",18,15,19,28,41,67,83,67,64,38,26,22]
["Gillam",20,19,23,22,43,56,79,76,57,42,38,23]
["Grand Rapids",18,13,21,26,52,77,71,66,59,38,26,22]
["Lynn Lake",20,16,20,24,37,62,85,69,61,38,27,19]
["Norway House",21,23,24,25,50,70,80,75,61,47,29,27]
["The Pas",17,13,18,24,40,66,69,67,57,38,21,20]
["Thompson",19,16,23,29,47,68,81,71,62,37,33,23]
["Fredericton",95,73,93,86,96,82,88,86,88,89,106,95]
["Mactaquac Provincial Park",101,64,90,86,100,87,98,85,92,97,101,99]
["Saint John",124,91,108,105,110,101,88,82,106,116,134,130]
["Saint Leonard",91,68,78,77,87,98,119,101,95,100,98,91]
["Sussex",109,85,115,90,103,88,84,74,100,106,110,106]
["Wiggins Point",99,71,84,89,108,89,80,89,80,94,112,92]
["Woodstock",104,72,91,80,94,91,100,101,96,95,103,103]
["Buctouche",104,88,93,86,101,95,99,85,86,95,103,101]
["Doaktown",106,77,90,83,113,95,106,94,100,101,112,97]
["Fundy National Park",145,108,146,121,127,110,99,94,123,133,159,147]
["Kouchibouguac National Park",138,99,123,107,112,91,110,87,84,100,121,125]
["Moncton",98,84,106,92,102,88,85,77,94,106,94,100]
["Sackville",103,75,93,89,108,94,87,82,107,106,108,95]
["Bathurst",98,68,73,91,77,92,96,118,72,84,107,95]
["Dalhousie",84,67,77,72,85,85,102,90,79,84,92,80]
["Kedgwick",72,59,50,61,84,106,122,103,86,95,80,73]
["Miramichi",87,71,91,85,99,86,100,93,84,90,101,85]
["Mount Carleton Provincial Park",99,68,77,76,93,105,119,104,97,95,97,91]
["Upsalquitch Lake",86,49,85,88,101,104,131,106,101,107,74,69]
["Come By Chance",130,117,109,96,95,132,93,89,118,131,120,110]
["Harbour Grace",124,124,115,94,85,121,89,89,135,138,112,103]
["Long Harbour",130,118,116,112,92,121,102,97,126,135,127,117]
["St John's",149,130,142,123,103,98,92,100,130,156,148,165]
["St Shotts",138,114,129,115,111,139,137,113,127,143,146,140]
["Bonavista",101,104,103,83,76,90,82,79,108,115,105,107]
["St Lawrence",145,141,126,122,125,146,115,94,172,157,158,142]
["Terra Nova National Park",111,118,103,91,82,103,98,88,119,105,97,116]
["Baie Verte",104,87,75,74,79,108,86,115,92,112,88,96]
["Burgeo",156,124,110,138,127,155,138,129,144,155,164,146]
["Gander",112,105,113,95,90,88,95,104,115,114,113,127]
["Grand Falls",94,94,91,84,78,89,89,107,96,94,94,90]
["Harbour Breton",112,120,102,125,117,138,119,93,140,147,150,121]
["Musgrave Harbour",88,82,76,74,73,75,82,93,110,100,93,98]
["Springdale",79,65,57,61,73,100,92,106,90,88,70,71]
["Channel-Port-Aux-Basques",152,125,108,139,119,127,113,119,125,145,151,172]
["Corner Brook",145,106,93,80,86,87,92,107,106,112,122,149]
["Deer Lake",114,84,73,70,77,81,95,110,100,89,91,111]
["Gros Morne National Park",237,138,93,81,85,123,96,133,127,159,156,200]
["Port Saunders",127,93,79,57,79,105,107,99,115,97,82,107]
["Rocky Harbour",136,106,87,69,74,118,80,117,105,123,120,137]
["St Anthony",114,95,98,82,83,123,106,108,120,125,116,138]
["Stephenville",125,105,86,78,97,104,118,130,128,127,118,123]
["Cartwright",86,91,92,75,68,99,101,94,89,102,85,92]
["Churchill Falls",53,44,55,64,61,80,112,93,111,82,78,54]
["Happy Valley - Goose Bay",65,57,65,64,69,91,121,99,91,81,72,64]
["Makkovik",73,75,73,62,52,94,101,98,92,92,84,84]
["Mary's Harbour",69,81,67,51,73,95,86,89,68,93,84,87]
["Nain",84,71,74,71,57,83,99,71,82,74,78,82]
["Wabush Lake",49,40,54,49,53,83,114,103,97,76,71,50]
["Baddeck",155,126,129,126,104,105,97,107,128,137,155,166]
["Cheticamp",143,108,103,88,85,96,90,114,124,130,141,153]
["Ingonish Beach",186,140,154,169,109,91,93,114,144,176,190,188]
["Louisbourg",147,138,144,148,128,113,108,108,133,158,169,153]
["Port Hawkesbury",121,116,113,106,98,97,96,82,117,157,147,134]
["Sydney",153,128,130,133,103,97,88,100,119,143,156,167]
["Pictou",110,95,100,94,84,90,77,81,118,129,135,121]
["Pugwash",88,65,77,82,95,82,73,78,98,104,100,96]
["Sable Island",145,113,130,115,101,116,101,122,130,145,151,145]
["Stillwater - Sherbrooke",131,115,130,112,119,113,96,110,138,139,165,156]
["Bridgewater",144,120,156,127,128,104,97,100,111,137,165,148]
["Halifax",140,110,132,118,119,112,110,96,109,124,151,145]
["Liverpool - Milton",159,137,165,146,136,109,98,89,122,128,180,176]
["Yarmouth",127,102,116,101,101,95,88,84,95,112,139,132]
["Amherst - Nappan",106,83,105,92,101,83,89,74,102,103,111,107]
["Annapolis Royal",114,85,94,95,86,74,69,69,110,120,125,113]
["Kejimkujik National Park",136,102,125,124,99,102,98,90,83,97,152,140]
["Kentville",116,101,110,93,102,82,84,77,84,89,122,122]
["Parrsboro",115,89,115,104,105,102,90,86,113,109,120,122]
["Truro",115,90,104,85,94,93,85,80,103,105,115,114]
["Belleville",67,58,62,76,81,74,65,75,92,85,96,79]
["Cornwall",76,60,62,81,88,97,99,89,98,93,92,76]
["Kingston",65,65,69,87,77,72,64,94,90,92,100,84]
["Ottawa",63,50,57,71,87,93,84,84,93,86,83,70]
["Pembroke",48,42,56,60,76,70,75,83,84,77,69,59]
["Barrie",83,62,58,62,82,85,77,90,94,78,89,74]
["Brantford",55,51,59,69,81,76,95,75,87,70,84,65]
["French River, Chaudiere Dam",75,61,59,67,90,74,80,79,106,100,87,80]
["Hamilton",57,57,64,73,85,73,83,90,81,72,91,72]
["Huntsville",93,72,68,61,89,78,83,81,111,105,99,94]
["Midland",103,64,56,70,84,81,78,78,95,94,104,95]
["Niagara Falls",64,64,68,75,83,85,84,78,88,84,102,87]
["Oshawa",66,57,54,73,79,74,73,77,94,70,85,71]
["Peterborough",55,61,54,70,83,73,61,96,84,77,83,74]
["St Catharines",65,55,62,77,77,86,78,70,91,67,82,71]
["Toronto",62,55,54,68,82,71,64,81,85,64,84,61]
["Chatham-Kent",63,54,60,80,80,78,85,79,89,71,77,67]
["Guelph",52,58,67,74,80,79,96,93,90,72,91,81]
["London",74,65,72,83,90,92,83,83,103,81,98,87]
["Owen Sound",129,86,78,71,84,73,70,79,106,98,110,130]
["Point Pelee National Park",57,59,70,76,77,80,84,86,93,70,95,77]
["Sarnia",52,51,57,72,80,83,78,79,105,76,82,64]
["Waterloo",65,55,61,75,82,82,99,84,88,67,87,71]
["Windsor",62,62,70,83,89,86,89,73,94,73,80,74]
["Chapleau",52,43,47,53,70,80,82,76,95,83,64,64]
["Gore Bay",45,30,63,67,61,65,48,65,88,107,94,70]
["Kapuskasing",48,36,48,55,69,80,102,77,101,86,71,56]
["Moosonee",33,29,35,38,55,72,97,78,95,75,56,42]
["North Bay",69,57,65,72,96,98,99,91,115,107,98,78]
["Sault Ste Marie",64,43,56,65,66,74,72,83,102,102,92,77]
["South Baymouth",78,50,64,69,72,59,51,74,95,112,92,94]
["Sudbury",62,51,60,66,83,80,77,85,101,91,78,67]
["Timmins",52,41,55,56,67,83,91,82,85,82,76,64]
["Wawa",56,47,54,67,78,82,96,93,122,118,86,73]
["Atikokan",35,25,33,50,77,104,118,88,100,76,45,36]
["Big Trout Lake",22,19,31,33,40,80,85,89,90,50,55,28]
["Dryden",27,20,30,40,73,115,103,84,89,64,47,29]
["Fort Frances",35,22,26,41,78,119,97,92,83,57,46,32]
["Kenora",26,19,28,36,81,119,103,84,86,63,42,28]
["Red Lake",27,17,28,34,73,99,103,88,83,60,43,30]
["Thunder Bay",26,20,31,53,67,84,87,89,73,64,53,35]
["Alberton",96,74,81,80,93,82,86,80,92,96,99,94]
["O'Leary",99,82,89,86,103,85,96,88,102,100,112,107]
["Summerside",96,75,79,84,98,91,74,93,97,88,98,100]
["Tignish",113,82,74,77,93,88,89,88,78,99,116,109]
["Charlottetown",101,83,86,84,91,99,80,96,96,112,113,118]
["Long River",84,64,69,75,98,92,82,91,101,103,105,93]
["New Glasgow",120,87,96,97,102,98,79,88,107,123,129,133]
["Stanhope",123,91,79,88,107,87,63,95,93,102,123,133]
["Victoria",98,71,97,80,91,76,73,57,95,89,89,99]
["Alliston",93,79,75,96,83,94,89,75,128,127,123,117]
["Baltic",116,91,96,93,93,101,87,104,115,122,126,129]
["Bangor",120,99,99,94,96,94,82,96,112,120,129,141]
["Monticello",101,82,87,87,90,91,79,89,108,115,124,118]
["Drummondville",86,72,70,80,94,102,106,106,95,102,104,98]
["Granby",97,73,87,90,97,116,118,123,105,103,105,102]
["Montréal",77,63,69,82,81,87,89,94,83,91,96,87]
["Sherbrooke",74,62,71,84,94,108,110,126,95,90,99,87]
["Sorel - Tracy",74,62,61,78,86,97,99,96,81,95,92,80]
["St Hyacinthe",76,61,61,80,89,102,104,104,83,102,98,95]
["Thetford Mines",108,87,89,88,105,130,133,135,100,112,105,117]
["Joliette",78,61,66,83,84,107,90,90,95,92,96,78]
["La Tuque",58,46,55,55,84,94,130,94,95,82,74,53]
["Québec City",87,75,76,84,107,111,125,104,116,98,102,100]
["Roberval",54,44,52,63,74,83,106,86,84,71,84,64]
["Saguenay",58,51,52,62,81,88,112,91,103,85,78,70]
["Trois-Rivières",83,69,76,79,96,107,117,101,101,98,102,93]
["Amos",56,36,50,65,87,94,112,98,107,87,79,58]
["Lachute",91,70,73,88,96,115,100,104,108,110,106,90]
["Maniwaki",55,52,66,65,85,83,79,111,77,93,82,64]
["Mont Laurier",69,54,62,71,90,93,101,100,93,98,89,77]
["St Donat",95,77,67,75,99,106,97,110,108,105,102,89]
["St Jerome",74,59,64,92,93,114,98,88,99,98,103,67]
["Ste-Agathe-des-Monts",82,83,75,81,91,107,81,113,95,103,116,100]
["Val-D'or",52,39,59,66,85,90,97,93,95,84,84,60]
["Caplan",80,56,60,64,92,87,100,95,79,88,86,70]
["Gaspé",88,65,98,90,89,80,100,94,82,121,111,117]
["Iles de la Madeleine",97,74,76,74,86,76,76,85,96,94,109,94]
["Rimouski",71,65,60,65,85,85,91,86,88,92,84,88]
["Ste-Anne-des-Monts",61,45,59,54,74,80,92,81,78,92,81,66]
["Baie-Comeau",83,65,68,80,91,89,93,75,86,95,96,79]
["Blanc-Sablon",97,84,80,50,69,92,102,96,89,88,75,100]
["Fermont",48,31,43,41,47,79,118,101,104,63,58,51]
["Natashquan",91,70,90,80,86,88,105,92,95,104,103,94]
["Schefferville",50,30,50,56,50,75,96,83,115,75,64,48]
["Sept-Iles",82,69,81,92,87,99,104,84,109,104,109,99]
["Tadoussac",70,59,62,77,93,86,115,103,85,87,82,63]
["Inukjuak",14,13,17,22,29,41,53,58,82,57,46,27]
["Kuujjuaq",32,29,32,27,29,50,60,71,74,55,48,36]
["Kuujjuarapik",28,23,23,24,33,60,76,92,109,82,66,46]
["Radisson",31,22,29,33,39,65,79,91,111,87,68,43]
["Cypress Hills",28,22,35,46,62,122,40,39,49,26,21,31]
["Estevan",18,14,22,24,56,75,67,52,36,28,17,17]
["Moose Jaw",17,11,20,18,48,59,63,39,38,20,17,17]
["Moosomin",21,15,26,24,66,90,78,64,56,35,20,19]
["Qu'Appelle Valley",16,11,23,27,61,83,75,58,38,26,18,19]
["Regina",15,9,20,24,51,71,67,45,33,25,14,16]
["Swift Current",17,12,19,19,51,77,60,47,36,19,16,19]
["Weyburn",20,12,22,28,57,75,66,47,33,24,18,21]
["Good Spirit Lake",15,13,24,26,60,86,78,66,47,27,19,22]
["Kindersley",11,7,12,23,40,67,56,44,29,13,11,12]
["Last Mountain Lake",17,10,18,26,43,75,54,51,33,21,15,18]
["Lloydminster",21,14,20,31,38,63,71,50,33,18,29,24]
["Melfort",15,10,17,27,43,54,77,52,39,28,17,18]
["North Battleford",16,10,14,26,33,65,74,58,34,16,16,14]
["Saskatoon",13,10,13,23,43,63,67,49,39,19,13,14]
["Yorkton",16,11,20,22,51,80,78,62,45,27,16,21]
["Buffalo Narrows",21,19,17,26,40,62,80,62,44,32,25,22]
["Collins Bay",21,21,27,22,49,50,77,92,60,47,36,26]
["Cree Lake",18,16,16,24,31,67,84,67,45,35,29,17]
["La Ronge",19,15,21,36,44,67,81,61,56,37,28,23]
["Meadow Lake",16,10,14,25,44,66,75,63,41,23,19,18]
["Nipawin",15,12,15,25,43,74,83,57,41,28,16,18]
["Prince Albert",16,12,18,27,45,69,77,62,43,26,17,17]