{"text_format":"1","workbook":"xlsx","n_sheets":3,"sheets":["RAIN-TANK 2017","Rainfall Data","Rainfall Data (2)"],"not_rendered":{"charts":0,"images":4,"macros":1,"external_links":0,"defined_names":18,"comments":0,"pivot_tables":0},"unopened":[],"bounds":{"document_bytes":16777216,"sheet_cells":100000,"rows_first":2000,"rows_last":500,"rows_between":2000,"halvings":0,"cell_chars":16384,"cell_head_chars":4096},"cells_cut":0,"cells_raw":0,"read":"whole","date_system":"1900"}

{"sheet":"RAIN-TANK 2017","index":0,"n_rows":51,"n_cols":26,"rows_kept":51,"cut":false,"hidden":false,"merged":[[4,2,4,14],[3,9,3,10],[1,7,1,8],[2,7,2,8],[23,2,23,14]]}
[]
[null,"RAINWATER HARVESTING STORAGE WORKSHEET ",null,null,null,null,null,"WEATHER STATION:",null,null,"Friday Harbor, San Juan Island",null,null,null,null,null,null,null,"Country"]
[null,"Optimize your storage volume ",null,null,null,null,null,"PROJECT NAME:",null,"Test",null,null,null,null,null,null,null,null,"Aberdeen",{"$f":"--ISNUMBER(IFERROR(SEARCH($K$2,S3,1),\"\"))","v":0},{"$f":"IF(T3=1,COUNTIF($T$3:T3,1),\"\")","v":""},{"$f":"IFERROR(INDEX($S$3:$S$21,MATCH(ROWS($U$3:U3),$U$3:$U$21,0)),\"\")","v":"Friday Harbor, San Juan Island"},{"$f":"IFERROR(INDEX($S$3:$S$21,MATCH(ROWS($U$3:V3),$U$3:$U$21,0)),\"\")","v":"Friday Harbor, San Juan Island"},{"$f":"IFERROR(INDEX($S$3:$S$21,MATCH(ROWS($U$3:U3),$U$3:$U$21,0)),\"\")","v":"Friday Harbor, San Juan Island"},null,{"$f":"$V$3:INDEX($V$3:$V$21,MAX($U$3:$U$21),1)","v":"Friday Harbor, San Juan Island"}]
[null,null,null,null,null,null,null,"DATE:",null,"2017-07-21",null,null,null,null,null,null,null,null,"Clearwater",{"$f":"--ISNUMBER(IFERROR(SEARCH($K$2,S4,1),\"\"))","v":0},{"$f":"IF(T4=1,COUNTIF($T$3:T4,1),\"\")","v":""},{"$f":"IFERROR(INDEX($S$3:$S$21,MATCH(ROWS($U$3:U4),$U$3:$U$21,0)),\"\")","v":""},{"$f":"IFERROR(INDEX($S$3:$S$21,MATCH(ROWS($U$3:V4),$U$3:$U$21,0)),\"\")","v":""},{"$f":"IFERROR(INDEX($S$3:$S$21,MATCH(ROWS($U$3:U4),$U$3:$U$21,0)),\"\")","v":""},null,{"$f":"$V$3:INDEX($V$3:$V$21,MAX($U$3:$U$21),1)","v":"Friday Harbor, San Juan Island"}]
[null,null,"INPUTS",null,null,null,null,null,null,null,null,null,null,null,null,null,null,null,"Forks",0,{"$f":"IF(T5=1,COUNTIF($T$3:T5,1),\"\")","v":""},{"$f":"IFERROR(INDEX($S$3:$S$21,MATCH(ROWS($U$3:U5),$U$3:$U$21,0)),\"\")","v":""},{"$f":"IFERROR(INDEX($S$3:$S$21,MATCH(ROWS($U$3:V5),$U$3:$U$21,0)),\"\")","v":""},{"$f":"IFERROR(INDEX($S$3:$S$21,MATCH(ROWS($U$3:U5),$U$3:$U$21,0)),\"\")","v":""},null,{"$f":"$V$3:INDEX($V$3:$V$21,MAX($U$3:$U$21),1)","v":"Friday Harbor, San Juan Island"}]
[null,null,null,null,null,null,null,null,null,null,null,null,null,null,null,null,null,null,"Friday Harbor, San Juan Island",1,{"$f":"IF(T6=1,COUNTIF($T$3:T6,1),\"\")","v":1},{"$f":"IFERROR(INDEX($S$3:$S$21,MATCH(ROWS($U$3:U6),$U$3:$U$21,0)),\"\")","v":""},{"$f":"IFERROR(INDEX($S$3:$S$21,MATCH(ROWS($U$3:V6),$U$3:$U$21,0)),\"\")","v":""},{"$f":"IFERROR(INDEX($S$3:$S$21,MATCH(ROWS($U$3:U6),$U$3:$U$21,0)),\"\")","v":""},null,{"$f":"$V$3:INDEX($V$3:$V$21,MAX($U$3:$U$21),1)","v":"Friday Harbor, San Juan Island"}]
[null,"MONTH","JAN","FEB","MAR","APR","MAY","JUN","JUL","AUG","SEPT","OCT","NOV","DEC","TOTAL","Column1",null,null,"Grayland",0,{"$f":"IF(T7=1,COUNTIF($T$3:T7,1),\"\")","v":""},{"$f":"IFERROR(INDEX($S$3:$S$21,MATCH(ROWS($U$3:U7),$U$3:$U$21,0)),\"\")","v":""},{"$f":"IFERROR(INDEX($S$3:$S$21,MATCH(ROWS($U$3:V7),$U$3:$U$21,0)),\"\")","v":""},{"$f":"IFERROR(INDEX($S$3:$S$21,MATCH(ROWS($U$3:U7),$U$3:$U$21,0)),\"\")","v":""},null,{"$f":"$V$3:INDEX($V$3:$V$21,MAX($U$3:$U$21),1)","v":"Friday Harbor, San Juan Island"}]
[null,"Washington State Precipitation (Inches)                             ",{"$f":"VLOOKUP($K$2,'Rainfall Data'!$A$4:$O$40,2,FALSE)","v":4.2},{"$f":"VLOOKUP($K$2,'Rainfall Data'!$A$4:$O$40,3,FALSE)","v":2.1},{"$f":"VLOOKUP($K$2,'Rainfall Data'!$A$4:$O$40,4,FALSE)","v":2},{"$f":"VLOOKUP($K$2,'Rainfall Data'!$A$4:$O$40,5,FALSE)","v":1.6},{"$f":"VLOOKUP($K$2,'Rainfall Data'!$A$4:$O$40,6,FALSE)","v":1.5},{"$f":"VLOOKUP($K$2,'Rainfall Data'!$A$4:$O$40,7,FALSE)","v":1.1000000000000001},{"$f":"VLOOKUP($K$2,'Rainfall Data'!$A$4:$O$40,8,FALSE)","v":0.8},{"$f":"VLOOKUP($K$2,'Rainfall Data'!$A$4:$O$40,9,FALSE)","v":0.9},{"$f":"VLOOKUP($K$2,'Rainfall Data'!$A$4:$O$40,10,FALSE)","v":1.4},{"$f":"VLOOKUP($K$2,'Rainfall Data'!$A$4:$O$40,11,FALSE)","v":2.7},{"$f":"VLOOKUP($K$2,'Rainfall Data'!$A$4:$O$40,12,FALSE)","v":4},{"$f":"VLOOKUP($K$2,'Rainfall Data'!$A$4:$O$40,13,FALSE)","v":2.8},{"$f":"SUM(CheckList1[[#This Row],[JAN]:[DEC]])","v":25.1},null,null,null,"Long Beach",0,{"$f":"IF(T8=1,COUNTIF($T$3:T8,1),\"\")","v":""},{"$f":"IFERROR(INDEX($S$3:$S$21,MATCH(ROWS($U$3:U8),$U$3:$U$21,0)),\"\")","v":""},{"$f":"IFERROR(INDEX($S$3:$S$21,MATCH(ROWS($U$3:V8),$U$3:$U$21,0)),\"\")","v":""},{"$f":"IFERROR(INDEX($S$3:$S$21,MATCH(ROWS($U$3:U8),$U$3:$U$21,0)),\"\")","v":""},null,{"$f":"$V$3:INDEX($V$3:$V$21,MAX($U$3:$U$21),1)","v":"Friday Harbor, San Juan Island"}]
[null,"mm to Inches & inches  to Gallon",{"$f":"C8*(7.49/12)","v":2.6215000000000002},{"$f":"D8*(7.49/12)","v":1.3107500000000001},1.2483333333333333,0.9986666666666667,0.93625000000000003,0.68658333333333332,0.49933333333333335,0.56174999999999997,0.87383333333333324,1.6852500000000001,2.4966666666666666,1.7476666666666665,{"$f":"SUM(CheckList1[[#This Row],[JAN]:[DEC]])","v":15.666583333333332},null,null,null,"Port Angeles",0,{"$f":"IF(T9=1,COUNTIF($T$3:T9,1),\"\")","v":""},{"$f":"IFERROR(INDEX($S$3:$S$21,MATCH(ROWS($U$3:U9),$U$3:$U$21,0)),\"\")","v":""},{"$f":"IFERROR(INDEX($S$3:$S$21,MATCH(ROWS($U$3:V9),$U$3:$U$21,0)),\"\")","v":""},{"$f":"IFERROR(INDEX($S$3:$S$21,MATCH(ROWS($U$3:U9),$U$3:$U$21,0)),\"\")","v":""},null,{"$f":"$V$3:INDEX($V$3:$V$21,MAX($U$3:$U$21),1)","v":"Friday Harbor, San Juan Island"}]
[null,"Precipitation Received from Roof (US gals)",{"$f":"($C$36*C9)*$C$37","v":5898.375},2949.1875,2808.75,2247.0000000000005,2106.5625,1544.8125,1123.5000000000002,1263.9375,1966.1249999999998,3791.8125,5617.5,3932.2499999999995,{"$f":"SUM(CheckList1[[#This Row],[JAN]:[DEC]])","v":35249.8125},null,null,null,"Anacortes",0,{"$f":"IF(T10=1,COUNTIF($T$3:T10,1),\"\")","v":""},{"$f":"IFERROR(INDEX($S$3:$S$21,MATCH(ROWS($U$3:U10),$U$3:$U$21,0)),\"\")","v":""},{"$f":"IFERROR(INDEX($S$3:$S$21,MATCH(ROWS($U$3:V10),$U$3:$U$21,0)),\"\")","v":""},{"$f":"IFERROR(INDEX($S$3:$S$21,MATCH(ROWS($U$3:U10),$U$3:$U$21,0)),\"\")","v":""},null,{"$f":"$V$3:INDEX($V$3:$V$21,MAX($U$3:$U$21),1)","v":"Friday Harbor, San Juan Island"}]
[null,"Start of Month in Storage (US gals) (Last Dec.)        ",null,{"$f":"IF(C17>0,(C17),(0))","v":3398.375},{"$f":"IF(D17>0,(D17),(0))","v":3847.5625},4156.3125,3903.3125,3509.875,1554.6875,0,0,0,0,3117.5,null,null,null,null,"Bellingham",0,{"$f":"IF(T11=1,COUNTIF($T$3:T11,1),\"\")","v":""},{"$f":"IFERROR(INDEX($S$3:$S$21,MATCH(ROWS($U$3:U11),$U$3:$U$21,0)),\"\")","v":""},{"$f":"IFERROR(INDEX($S$3:$S$21,MATCH(ROWS($U$3:V11),$U$3:$U$21,0)),\"\")","v":""},{"$f":"IFERROR(INDEX($S$3:$S$21,MATCH(ROWS($U$3:U11),$U$3:$U$21,0)),\"\")","v":""},null,{"$f":"$V$3:INDEX($V$3:$V$21,MAX($U$3:$U$21),1)","v":"Friday Harbor, San Juan Island"}]
[null,"Household Usage (US gals)                        ",2500,2500,2500,2500,2500,2500,2500,2500,2500,2500,2500,2500,{"$f":"SUM(CheckList1[[#This Row],[JAN]:[DEC]])","v":30000},null,null,null,"Bremerton",0,{"$f":"IF(T12=1,COUNTIF($T$3:T12,1),\"\")","v":""},{"$f":"IFERROR(INDEX($S$3:$S$21,MATCH(ROWS($U$3:U12),$U$3:$U$21,0)),\"\")","v":""},{"$f":"IFERROR(INDEX($S$3:$S$21,MATCH(ROWS($U$3:V12),$U$3:$U$21,0)),\"\")","v":""},{"$f":"IFERROR(INDEX($S$3:$S$21,MATCH(ROWS($U$3:U12),$U$3:$U$21,0)),\"\")","v":""},null,{"$f":"$V$3:INDEX($V$3:$V$21,MAX($U$3:$U$21),1)","v":"Friday Harbor, San Juan Island"}]
[null,"Irrigation/Outside Usage (US gals)                           ",null,null,null,null,null,1000,2000,2000,2000,1500,null,null,{"$f":"SUM(CheckList1[[#This Row],[JAN]:[DEC]])","v":8500},null,null,null,"Everett",0,{"$f":"IF(T13=1,COUNTIF($T$3:T13,1),\"\")","v":""},{"$f":"IFERROR(INDEX($S$3:$S$21,MATCH(ROWS($U$3:U13),$U$3:$U$21,0)),\"\")","v":""},{"$f":"IFERROR(INDEX($S$3:$S$21,MATCH(ROWS($U$3:V13),$U$3:$U$21,0)),\"\")","v":""},{"$f":"IFERROR(INDEX($S$3:$S$21,MATCH(ROWS($U$3:U13),$U$3:$U$21,0)),\"\")","v":""},null,{"$f":"$V$3:INDEX($V$3:$V$21,MAX($U$3:$U$21),1)","v":"Friday Harbor, San Juan Island"}]
[null,"Total Usage  (US gals)",{"$f":"C13+C12","v":2500},{"$f":"D13+D12","v":2500},2500,2500,2500,3500,4500,4500,4500,4000,2500,2500,{"$f":"SUM(CheckList1[[#This Row],[JAN]:[DEC]])","v":38500},null,null,null,"Longview",0,{"$f":"IF(T14=1,COUNTIF($T$3:T14,1),\"\")","v":""},{"$f":"IFERROR(INDEX($S$3:$S$21,MATCH(ROWS($U$3:U14),$U$3:$U$21,0)),\"\")","v":""},{"$f":"IFERROR(INDEX($S$3:$S$21,MATCH(ROWS($U$3:V14),$U$3:$U$21,0)),\"\")","v":""},{"$f":"IFERROR(INDEX($S$3:$S$21,MATCH(ROWS($U$3:U14),$U$3:$U$21,0)),\"\")","v":""},null,{"$f":"$V$3:INDEX($V$3:$V$21,MAX($U$3:$U$21),1)","v":"Friday Harbor, San Juan Island"}]
[null,"End of Month (no Storage Limit) (imp gals)",{"$f":"C10+C11-C14","v":3398.375},3847.5625,4156.3125,3903.3125,3509.875,1554.6875,-1821.8125,-3236.0625,-2533.875,-208.1875,3117.5,4549.75,null,{"$f":"SUM(CheckList1[[#This Row],[JAN]:[DEC]])","v":20237.4375},null,null,"Olga, Orcas Island",0,{"$f":"IF(T15=1,COUNTIF($T$3:T15,1),\"\")","v":""},{"$f":"IFERROR(INDEX($S$3:$S$21,MATCH(ROWS($U$3:U15),$U$3:$U$21,0)),\"\")","v":""},{"$f":"IFERROR(INDEX($S$3:$S$21,MATCH(ROWS($U$3:V15),$U$3:$U$21,0)),\"\")","v":""},{"$f":"IFERROR(INDEX($S$3:$S$21,MATCH(ROWS($U$3:U15),$U$3:$U$21,0)),\"\")","v":""},null,{"$f":"$V$3:INDEX($V$3:$V$21,MAX($U$3:$U$21),1)","v":"Friday Harbor, San Juan Island"}]
[null,"Overflow Volume - wastage  (imp gals)",{"$f":"C15-C17","v":0},{"$f":"D15-D17","v":0},0,0,0,0,0,0,0,0,0,0,{"$f":"SUM(CheckList1[[#This Row],[JAN]:[DEC]])","v":0}]
[null,"End of Month in Storage (US gals) (make-up)",{"$f":"IF(C15>$C$35,($C$35),(C15))","v":3398.375},3847.5625,4156.3125,3903.3125,3509.875,1554.6875,-1821.8125,-3236.0625,-2533.875,-208.1875,3117.5,4549.75,null,{"$f":"SUM(CheckList1[[#This Row],[JAN]:[DEC]])","v":20237.4375},null,null,"Olympia",0,{"$f":"IF(T17=1,COUNTIF($T$3:T17,1),\"\")","v":""},{"$f":"IFERROR(INDEX($S$3:$S$21,MATCH(ROWS($U$3:U17),$U$3:$U$21,0)),\"\")","v":""},{"$f":"IFERROR(INDEX($S$3:$S$21,MATCH(ROWS($U$3:V17),$U$3:$U$21,0)),\"\")","v":""},{"$f":"IFERROR(INDEX($S$3:$S$21,MATCH(ROWS($U$3:U17),$U$3:$U$21,0)),\"\")","v":""},null,{"$f":"$V$3:INDEX($V$3:$V$21,MAX($U$3:$U$21),1)","v":"Friday Harbor, San Juan Island"}]
[null,"ANNUAL OVERFLOW VOLUME (WASTAGE)",{"$f":"100%-((O10-(P15-P17))/O10)","v":0},null,null,null,null,null,null,null,null,null,null,null,null,null,null,null,"Port Townsend",0,{"$f":"IF(T18=1,COUNTIF($T$3:T18,1),\"\")","v":""},{"$f":"IFERROR(INDEX($S$3:$S$21,MATCH(ROWS($U$3:U18),$U$3:$U$21,0)),\"\")","v":""},{"$f":"IFERROR(INDEX($S$3:$S$21,MATCH(ROWS($U$3:V18),$U$3:$U$21,0)),\"\")","v":""},{"$f":"IFERROR(INDEX($S$3:$S$21,MATCH(ROWS($U$3:U18),$U$3:$U$21,0)),\"\")","v":""},null,{"$f":"$V$3:INDEX($V$3:$V$21,MAX($U$3:$U$21),1)","v":"Friday Harbor, San Juan Island"}]
[null,"ANNUAL MAKE-UP WATER (SHORTFALL) ",{"$f":"(IF(C15<0,($C15),(0))+IF(D15<0,($D15),(0))+IF(E15<0,($E15),(0))+IF(F15<0,($F15),(0))+IF(G15<0,($G15),(0))+IF(H15<0,($H15),(0))+IF(I15<0,($I15),(0))+IF(J15<0,($J15),(0))+IF(K15<0,($K15),(0))+IF(L15<0,($L15),(0))+IF(M15<0,($M15),(0))+IF(N15<0,($N15),(0)))/O14","v":-0.20259577922077923},null,null,null,null,null,null,null,null,null,null,null,null,null,null,null,"Seattle",0,{"$f":"IF(T19=1,COUNTIF($T$3:T19,1),\"\")","v":""},{"$f":"IFERROR(INDEX($S$3:$S$21,MATCH(ROWS($U$3:U19),$U$3:$U$21,0)),\"\")","v":""},{"$f":"IFERROR(INDEX($S$3:$S$21,MATCH(ROWS($U$3:V19),$U$3:$U$21,0)),\"\")","v":""},{"$f":"IFERROR(INDEX($S$3:$S$21,MATCH(ROWS($U$3:U19),$U$3:$U$21,0)),\"\")","v":""},null,{"$f":"$V$3:INDEX($V$3:$V$21,MAX($U$3:$U$21),1)","v":"Friday Harbor, San Juan Island"}]
[null,null,null,null,null,null,null,null,null,null,null,null,null,null,null,null,null,null,"Tacoma",0,{"$f":"IF(T20=1,COUNTIF($T$3:T20,1),\"\")","v":""},{"$f":"IFERROR(INDEX($S$3:$S$21,MATCH(ROWS($U$3:U20),$U$3:$U$21,0)),\"\")","v":""},{"$f":"IFERROR(INDEX($S$3:$S$21,MATCH(ROWS($U$3:V20),$U$3:$U$21,0)),\"\")","v":""},{"$f":"IFERROR(INDEX($S$3:$S$21,MATCH(ROWS($U$3:U20),$U$3:$U$21,0)),\"\")","v":""},null,{"$f":"$V$3:INDEX($V$3:$V$21,MAX($U$3:$U$21),1)","v":"Friday Harbor, San Juan Island"}]
[null,null,null,null,null,null,null,null,null,null,null,null,null,null,null,null,null,null,"Darrington",0,{"$f":"IF(T21=1,COUNTIF($T$3:T21,1),\"\")","v":""},{"$f":"IFERROR(INDEX($S$3:$S$21,MATCH(ROWS($U$3:U21),$U$3:$U$21,0)),\"\")","v":""},{"$f":"IFERROR(INDEX($S$3:$S$21,MATCH(ROWS($U$3:V21),$U$3:$U$21,0)),\"\")","v":""},{"$f":"IFERROR(INDEX($S$3:$S$21,MATCH(ROWS($U$3:U21),$U$3:$U$21,0)),\"\")","v":""},null,{"$f":"$V$3:INDEX($V$3:$V$21,MAX($U$3:$U$21),1)","v":"Friday Harbor, San Juan Island"}]
[null,"Washington State Precipitation (Inches)                             ",{"$f":"VLOOKUP($K$2,'Rainfall Data'!$A$4:$O$40,2,FALSE)","v":4.2},{"$f":"VLOOKUP($K$2,'Rainfall Data'!$A$4:$O$40,3,FALSE)","v":2.1},{"$f":"VLOOKUP($K$2,'Rainfall Data'!$A$4:$O$40,4,FALSE)","v":2},{"$f":"VLOOKUP($K$2,'Rainfall Data'!$A$4:$O$40,5,FALSE)","v":1.6},{"$f":"VLOOKUP($K$2,'Rainfall Data'!$A$4:$O$40,6,FALSE)","v":1.5},{"$f":"VLOOKUP($K$2,'Rainfall Data'!$A$4:$O$40,7,FALSE)","v":1.1000000000000001},{"$f":"VLOOKUP($K$2,'Rainfall Data'!$A$4:$O$40,8,FALSE)","v":0.8},{"$f":"VLOOKUP($K$2,'Rainfall Data'!$A$4:$O$40,9,FALSE)","v":0.9},{"$f":"VLOOKUP($K$2,'Rainfall Data'!$A$4:$O$40,10,FALSE)","v":1.4},{"$f":"VLOOKUP($K$2,'Rainfall Data'!$A$4:$O$40,11,FALSE)","v":2.7},{"$f":"VLOOKUP($K$2,'Rainfall Data'!$A$4:$O$40,12,FALSE)","v":4},{"$f":"VLOOKUP($K$2,'Rainfall Data'!$A$4:$O$40,13,FALSE)","v":2.8},{"$f":"SUM(C22:N22)","v":25.1},null,null,null,"Long Beach",{"$f":"--ISNUMBER(IFERROR(SEARCH($K$2,S22,1),\"\"))","v":0},{"$f":"IF(T22=1,COUNTIF($T$3:T22,1),\"\")","v":""},{"$f":"IFERROR(INDEX($S$3:$S$21,MATCH(ROWS($U$3:U22),$U$3:$U$21,0)),\"\")","v":""},{"$f":"IFERROR(INDEX($S$3:$S$21,MATCH(ROWS($U$3:V22),$U$3:$U$21,0)),\"\")","v":""},{"$f":"IFERROR(INDEX($S$3:$S$21,MATCH(ROWS($U$3:U22),$U$3:$U$21,0)),\"\")","v":""},null,{"$f":"$V$3:INDEX($V$3:$V$21,MAX($U$3:$U$21),1)","v":"Friday Harbor, San Juan Island"}]
[null,"mm to Inches & inches  to Gallon",{"$f":"C22*(7.49/12)","v":2.6215000000000002},{"$f":"D22*(7.49/12)","v":1.3107500000000001},1.2483333333333333,0.9986666666666667,0.93625000000000003,0.68658333333333332,0.49933333333333335,0.56174999999999997,0.87383333333333324,1.6852500000000001,2.4966666666666666,1.7476666666666665,{"$f":"SUM(C23:N23)","v":15.666583333333332},null,null,null,"Port Angeles",0,{"$f":"IF(T23=1,COUNTIF($T$3:T23,1),\"\")","v":""},{"$f":"IFERROR(INDEX($S$3:$S$21,MATCH(ROWS($U$3:U23),$U$3:$U$21,0)),\"\")","v":""},{"$f":"IFERROR(INDEX($S$3:$S$21,MATCH(ROWS($U$3:V23),$U$3:$U$21,0)),\"\")","v":""},{"$f":"IFERROR(INDEX($S$3:$S$21,MATCH(ROWS($U$3:U23),$U$3:$U$21,0)),\"\")","v":""},null,{"$f":"$V$3:INDEX($V$3:$V$21,MAX($U$3:$U$21),1)","v":"Friday Harbor, San Juan Island"}]
[null,null,"OUTPUTS",null,null,null,null,null,null,null,null,null,null,null,null,null,null,null,"Forks",0,{"$f":"IF(T24=1,COUNTIF($T$3:T24,1),\"\")","v":""},{"$f":"IFERROR(INDEX($S$3:$S$21,MATCH(ROWS($U$3:U24),$U$3:$U$21,0)),\"\")","v":""},{"$f":"IFERROR(INDEX($S$3:$S$21,MATCH(ROWS($U$3:V24),$U$3:$U$21,0)),\"\")","v":""},{"$f":"IFERROR(INDEX($S$3:$S$21,MATCH(ROWS($U$3:U24),$U$3:$U$21,0)),\"\")","v":""},null,{"$f":"$V$3:INDEX($V$3:$V$21,MAX($U$3:$U$21),1)","v":"Friday Harbor, San Juan Island"}]
[null,"MONTH","JAN","FEB","MAR","APR","MAY","JUN","JUL","AUG","SEPT","OCT","NOV","DEC","TOTAL","Column1",null,null,"Grayland",0,{"$f":"IF(T25=1,COUNTIF($T$3:T25,1),\"\")","v":""},{"$f":"IFERROR(INDEX($S$3:$S$21,MATCH(ROWS($U$3:U25),$U$3:$U$21,0)),\"\")","v":""},{"$f":"IFERROR(INDEX($S$3:$S$21,MATCH(ROWS($U$3:V25),$U$3:$U$21,0)),\"\")","v":""},{"$f":"IFERROR(INDEX($S$3:$S$21,MATCH(ROWS($U$3:U25),$U$3:$U$21,0)),\"\")","v":""},null,{"$f":"$V$3:INDEX($V$3:$V$21,MAX($U$3:$U$21),1)","v":"Friday Harbor, San Juan Island"}]
[null,"Precipitation Received from Roof (US gals)",{"$f":"($C$36*C23)*$C$37","v":5898.375},2949.1875,2808.75,2247.0000000000005,2106.5625,1544.8125,1123.5000000000002,1263.9375,1966.1249999999998,3791.8125,5617.5,3932.2499999999995,35249.8125,null,null,null,"Anacortes",0,{"$f":"IF(T26=1,COUNTIF($T$3:T26,1),\"\")","v":""},{"$f":"IFERROR(INDEX($S$3:$S$21,MATCH(ROWS($U$3:U26),$U$3:$U$21,0)),\"\")","v":""},{"$f":"IFERROR(INDEX($S$3:$S$21,MATCH(ROWS($U$3:V26),$U$3:$U$21,0)),\"\")","v":""},{"$f":"IFERROR(INDEX($S$3:$S$21,MATCH(ROWS($U$3:U26),$U$3:$U$21,0)),\"\")","v":""},null,{"$f":"$V$3:INDEX($V$3:$V$21,MAX($U$3:$U$21),1)","v":"Friday Harbor, San Juan Island"}]
[null,"Start of Month in Storage (US gals) (Last Dec.)        ",{"$f":"N17","v":4549.75},{"$f":"IF(C33>0,(C33),(0))","v":6000},{"$f":"IF(D33>0,(D33),(0))","v":6000},{"$f":"IF(E33>0,(E33),(0))","v":6000},{"$f":"IF(F33>0,(F33),(0))","v":5747},{"$f":"IF(G33>0,(G33),(0))","v":5353.5625},{"$f":"IF(H33>0,(H33),(0))","v":3398.375},{"$f":"IF(I33>0,(I33),(0))","v":21.875},{"$f":"IF(J33>0,(J33),(0))","v":0},{"$f":"IF(K33>0,(K33),(0))","v":0},{"$f":"IF(L33>0,(L33),(0))","v":0},{"$f":"IF(M33>0,(M33),(0))","v":3117.5},null,null,null,null,"Bellingham",0,{"$f":"IF(T27=1,COUNTIF($T$3:T27,1),\"\")","v":""},{"$f":"IFERROR(INDEX($S$3:$S$21,MATCH(ROWS($U$3:U27),$U$3:$U$21,0)),\"\")","v":""},{"$f":"IFERROR(INDEX($S$3:$S$21,MATCH(ROWS($U$3:V27),$U$3:$U$21,0)),\"\")","v":""},{"$f":"IFERROR(INDEX($S$3:$S$21,MATCH(ROWS($U$3:U27),$U$3:$U$21,0)),\"\")","v":""},null,{"$f":"$V$3:INDEX($V$3:$V$21,MAX($U$3:$U$21),1)","v":"Friday Harbor, San Juan Island"}]
[null,"Household Usage (US gals)                        ",2500,2500,2500,2500,2500,2500,2500,2500,2500,2500,2500,2500,30000,null,null,null,"Bremerton",0,{"$f":"IF(T28=1,COUNTIF($T$3:T28,1),\"\")","v":""},{"$f":"IFERROR(INDEX($S$3:$S$21,MATCH(ROWS($U$3:U28),$U$3:$U$21,0)),\"\")","v":""},{"$f":"IFERROR(INDEX($S$3:$S$21,MATCH(ROWS($U$3:V28),$U$3:$U$21,0)),\"\")","v":""},{"$f":"IFERROR(INDEX($S$3:$S$21,MATCH(ROWS($U$3:U28),$U$3:$U$21,0)),\"\")","v":""},null,{"$f":"$V$3:INDEX($V$3:$V$21,MAX($U$3:$U$21),1)","v":"Friday Harbor, San Juan Island"}]
[null,"Irrigation/Outside Usage (US gals)                           ",null,null,null,null,null,1000,2000,2000,2000,1500,null,null,8500,null,null,null,"Everett",0,{"$f":"IF(T29=1,COUNTIF($T$3:T29,1),\"\")","v":""},{"$f":"IFERROR(INDEX($S$3:$S$21,MATCH(ROWS($U$3:U29),$U$3:$U$21,0)),\"\")","v":""},{"$f":"IFERROR(INDEX($S$3:$S$21,MATCH(ROWS($U$3:V29),$U$3:$U$21,0)),\"\")","v":""},{"$f":"IFERROR(INDEX($S$3:$S$21,MATCH(ROWS($U$3:U29),$U$3:$U$21,0)),\"\")","v":""},null,{"$f":"$V$3:INDEX($V$3:$V$21,MAX($U$3:$U$21),1)","v":"Friday Harbor, San Juan Island"}]
[null,"Total Usage  (US gals)",{"$f":"C29+C28","v":2500},{"$f":"D29+D28","v":2500},2500,2500,2500,3500,4500,4500,4500,4000,2500,2500,38500,null,null,null,"Longview",0,{"$f":"IF(T30=1,COUNTIF($T$3:T30,1),\"\")","v":""},{"$f":"IFERROR(INDEX($S$3:$S$21,MATCH(ROWS($U$3:U30),$U$3:$U$21,0)),\"\")","v":""},{"$f":"IFERROR(INDEX($S$3:$S$21,MATCH(ROWS($U$3:V30),$U$3:$U$21,0)),\"\")","v":""},{"$f":"IFERROR(INDEX($S$3:$S$21,MATCH(ROWS($U$3:U30),$U$3:$U$21,0)),\"\")","v":""},null,{"$f":"$V$3:INDEX($V$3:$V$21,MAX($U$3:$U$21),1)","v":"Friday Harbor, San Juan Island"}]
{"$rows_left_out":22}
{"sheet":"Rainfall Data","index":1,"n_rows":40,"n_cols":13,"rows_kept":40,"cut":false,"hidden":true,"merged":[[1,0,1,1]]}
[]
[]
["Place","JAN","FEB","MAR","APR","MAY","JUN","JUL","AUG","SEPT","OCT","NOV","DEC"]
["Aberdeen",13.6,9.3000000000000007,9,6.2,3.8,2.6,1.2,1.5,2.5,7.7,14.3,12.9]
["Clearwater",16.5,11.2,12.2,8.6,5.6,3.8,2.2000000000000002,2.7,4.3,10.7,16.8,14.3]
["Forks",18.3,12.7,13.5,9.1999999999999993,5.8,3.9,2.5,2.6,4,11.8,18.600000000000001,16.8]
["Friday Harbor, San Juan Island",4.2,2.1,2,1.6,1.5,1.1000000000000001,0.8,0.9,1.4,2.7,4,2.8]
["Grayland",11.1,7.9,8.1,5.7,3.6,2.6,1.4,1.6,2.6,7.6,12.1,10.8]
["Long Beach",11.8,8.4,8.6,6.3,3.8,2.9,1.4,1.7,2.6,7.2,12.3,11.7]
["Port Angeles",4,2.2999999999999998,2.2000000000000002,1.3,1.1000000000000001,0.9,0.6,0.7,0.9,2.7,4.5,4.0999999999999996]
["Anacortes",3.6,2.2999999999999998,2.2999999999999998,1.9,1.9,1.5,0.9,1,1.5,2.8,4.7,3.4]
["Bellingham",4.7,3,3.2,2.7,2.5,1.9,1.2,1.2,1.8,3.7,5.8,4.2]
["Bremerton",8.9,6,6,3.6,2.5,1.7,0.9,1,1.6,4.9000000000000004,9.4,10.1]
["Everett",5.0999999999999996,3.1,3.7,3,2.7,2.2999999999999998,1.2,1.2,2,3.6,5.6,5.2]
["Longview",6.6,4.9000000000000004,4.7,3.8,3.2,2.2999999999999998,0.8,1.2,2.1,4,7.7,6.8]
["Olga, Orcas Island",3.9,2.4,2.2999999999999998,1.9,1.8,1.3,0.8,1.1000000000000001,1.3,3,4.8,3.5]
["Olympia",7.8,5.3,5.3,3.5,2.2999999999999998,1.8,0.6,0.9,1.7,4.5999999999999996,8.6,7.5]
["Port Townsend",2.2999999999999998,1.5,1.7,1.5,1.7,1.3,0.8,0.7,1,1.6,2.7,2.5]
["Seattle",5.5,3.5,3.9,2.8,2,1.6,0.9,0.9,1.3,3.4,6,6.1]
["Tacoma",5.9,3.9,4.0999999999999996,3,2.1,1.6,0.7,0.8,1.3,3.7,6.7,5.5]
["Vancouver",5.9,4.4000000000000004,4.2,3.2,2.7,1.9,0.7,0.7,1.6,3.4,6.5,6.4]
["Baker Lake Dam",14.7,9.3000000000000007,9.3000000000000007,6.7,5.0999999999999996,3.7,2.2999999999999998,2.1,4.2,10.1,16.899999999999999,13.6]
["Baring",16,10.3,10.4,7.8,5.6,4.2,2.1,2,4.5999999999999996,11,18.899999999999999,14]
["Darrington",11.6,8.5,7.3,5.4,4,3.2,1.6,1.7,3,7.7,15.1,12.1]
["Mt Adams Ranger Station",7.4,5.0999999999999996,5.5,2.4,1.7,1.3,0.5,0.7,1.1000000000000001,3.9,7.8,8.6]
["Mt Rainier Paradise Ranger Station",18.2,12.7,12.6,8.3000000000000007,5.9,4.0999999999999996,2,2,4.7,10.4,20.3,17.2]
["Mud Mountain Lake Dam",7.2,5,5.8,5,4.8,3.9,1.9,1.7,2.8,5,8.6999999999999993,5.8]
["Ross Dam",9.3000000000000007,5.9,5.2,3.1,2.1,1.7,1.2,1.3,2.1,6.1,11.2,8.5]
["Stampede Pass",12.1,7.6,7.6,5.3,4.3,3.4,1.5,1.5,4.0999999999999996,7.8,14.7,11.3]
["Boundary Dam",3,1.9,2.2000000000000002,2.2000000000000002,2.7,3.1,1.6,1.2,1.4,2.1,3.2,3.5]
{"$rows_left_out":11}
{"sheet":"Rainfall Data (2)","index":2,"n_rows":271,"n_cols":13,"rows_kept":271,"cut":false,"hidden":true,"merged":[[1,0,1,1]]}
[]
[]
["Place","JAN","FEB","MAR","APR","MAY","JUN","JUL","AUG","SEPT","OCT","NOV","DEC"]
["Abbotsford",212,132,149,118,100,75,43,46,75,153,248,187]
["Atlin",46,25,17,9,18,30,33,34,42,37,36,36]
["Barkerville",96,61,66,58,78,102,100,81,82,92,111,95]
["Bella Coola",157,88,76,56,48,51,42,60,90,195,205,131]
["Campbell River",217,149,140,92,68,63,39,45,55,162,232,226]
["Castlegar",76,51,63,59,70,72,48,30,42,51,97,90]
["Chilliwack",233,126,155,116,93,92,48,57,75,178,284,210]
["Cortes Island, Whaletown",184,131,107,100,73,70,49,55,61,155,224,181]
["Courtenay - Comox",172,114,106,65,46,43,27,29,42,123,201,188]
["Cranbrook",26,19,22,25,46,62,38,28,31,20,35,33]
["Duncan",277,146,154,81,56,41,23,35,41,153,247,254]
["Fort Nelson",21,15,19,19,49,63,78,71,40,33,26,18]
["Fort St John",25,19,24,20,38,66,75,51,45,31,29,22]
["Gabriola Island",147,96,92,63,48,43,24,27,34,86,157,141]
["Gibsons",183,110,125,104,91,67,41,49,60,152,213,174]
["Gold River",424,286,266,187,120,91,56,71,109,359,491,391]
["Golden",46,24,24,24,34,50,51,45,38,35,51,44]
["Kamloops",21,12,13,14,27,37,31,24,29,19,23,25]
["Kelowna",30,20,21,24,31,40,33,26,27,24,35,32]
["Lillooet",38,20,17,19,26,24,36,26,24,34,44,42]
["Mayne Island, Village Bay",130,88,75,55,44,37,21,24,28,80,135,125]
["Nanaimo",188,126,113,67,54,43,25,28,36,102,197,184]
["North Vancouver, Capilano",330,279,218,207,132,124,61,72,98,248,437,316]
["Penticton",27,20,24,26,39,46,29,28,25,26,28,29]
["Port Alberni",291,255,190,127,79,55,26,38,49,204,317,276]
["Port Hardy",247,160,160,125,79,81,54,73,110,257,312,251]
["Port Renfrew",556,377,362,259,155,108,51,82,124,371,580,481]
{"$rows_left_out":241}